program: Orca
programVersion: 5.0.2
elementType: Cl Cl O O O N C C C C C C C C C C C C C C C C C C C C C C H H H H H H H H H H H H H H H H H H H
charge: 0
multiplicity: 1
keywords: wb97x-d3
keywords: def2-TZVPP
keywords: def2/J RIJCOSX
keywords: DEFGRID2
keywords: scfconv7
keywords: smallprint printgap noloewdin
keywords: NOSOSCF
formula: C22H19Cl2NO3
InChI: InChI=1/C22H19Cl2NO3/c1-22(2)17(12-19(23)24)20(22)21(26)28-18(13-25)14-7-6-10-16(11-14)27-15-8-4-3-5-9-15/h3-12,17-18,20H,1-2H3
47 atoms
Cl 0.653995 -4.053139 -2.021909
Cl 3.399323 -4.604743 -2.732282
O  -1.16595 -0.46591 -0.636644
O  -1.019415 -1.814409 1.151327
O  -1.172695 4.320829 0.783695
N  -3.742961 -1.088624 -2.61159
C  2.043831 -1.071396 0.867172
C  1.798742 -2.437395 0.328243
C  0.927862 -1.297439 -0.147459
C  1.728075 -0.805111 2.317008
C  3.208403 -0.265257 0.34697
C  2.725016 -3.08905 -0.624067
C  -0.492321 -1.255732 0.226391
C  2.316213 -3.815899 -1.653893
C  -2.547239 -0.252604 -0.44167
C  -2.845136 1.209215 -0.16668
C  -3.21481 -0.712624 -1.663779
C  -1.824086 2.081193 0.179939
C  -4.161764 1.652501 -0.221019
C  -2.134425 3.402801 0.482691
C  -4.450151 2.975769 0.070487
C  -3.443202 3.857492 0.430766
C  -0.055411 3.945248 1.482947
C  -0.145139 3.20726 2.657015
C  1.172899 4.383551 1.011481
C  1.014032 2.906674 3.357101
C  2.324009 4.082999 1.727361
C  2.251116 3.340362 2.897457
H  1.308235 -3.122943 1.015535
H  1.139425 -0.912401 -1.138271
H  2.623169 -0.974886 2.918672
H  0.946882 -1.450381 2.712727
H  1.422884 0.231575 2.468738
H  4.119726 -0.499203 0.900609
H  3.012413 0.801741 0.469444
H  3.404746 -0.442928 -0.711007
H  3.79234 -2.997229 -0.457105
H  -2.928762 -0.8608 0.385821
H  -0.79479 1.749515 0.211037
H  -4.963836 0.974924 -0.48715
H  -5.473538 3.324078 0.02603
H  -3.667769 4.890171 0.665595
H  -1.106233 2.873812 3.028839
H  1.225557 4.961608 0.097309
H  0.94561 2.33305 4.272464
H  3.282037 4.43015 1.362225
H  3.150642 3.104474 3.450714
elementType: Cl O N C H
totalener: -2050.68303212 hartree
nucrepener: 2821.62401594 hartree
electener: -4872.30704806 hartree
oneelecener: -8418.29217669 hartree
twoeener: 3545.98512863 hartree
cpcmener: -0.02931685 hartree
kineticenergy: 2044.47018698 hartree
xcener: -151.865173333267 hartree
chargesum: -0.0000000
charge: -0.048996 -0.054307 -0.288138 -0.434726 -0.327361 -0.089104 0.165888 -0.045053 -0.163314 -0.260745 -0.284554 -0.214579 0.410269 0.073780 0.414685 0.035146 -0.218008 -0.186515 -0.247527 0.261233 -0.108701 -0.242714 0.257942 -0.167574 -0.232008 -0.152676 -0.124403 -0.185855 0.114239 0.113178 0.100874 0.098597 0.078364 0.102519 0.094064 0.095960 0.140277 0.137910 0.150760 0.143778 0.158369 0.146451 0.156184 0.147109 0.163937 0.156985 0.158362
qa: -0.0490 -0.0543 -0.2881 -0.4347 -0.3274 -0.0891 0.1659 -0.0451 -0.1633 -0.2607 -0.2846 -0.2146 0.4103 0.0738 0.4147 0.0351 -0.2180 -0.1865 -0.2475 0.2612 -0.1087 -0.2427 0.2579 -0.1676 -0.2320 -0.1527 -0.1244 -0.1859 0.1142 0.1132 0.1009 0.0986 0.0784 0.1025 0.0941 0.0960 0.1403 0.1379 0.1508 0.1438 0.1584 0.1465 0.1562 0.1471 0.1639 0.1570 0.1584
va: 1.2820 1.2520 2.1047 2.0823 2.0789 3.1073 3.6754 3.9126 3.8455 3.8744 3.9261 3.9076 4.1353 4.1863 3.6916 3.7042 4.0390 3.9206 4.0094 3.7605 3.9069 4.0205 3.7089 3.8858 4.0031 3.8371 3.8594 3.8611 1.0213 1.0261 1.0026 1.0214 1.0153 0.9994 1.0041 1.0003 1.0080 1.0304 1.0107 1.0073 0.9894 1.0065 0.9966 1.0066 0.9886 0.9893 0.9910
dispcorr: -0.026570027 hartree
energy: -2050.709602149674
dipole: 5.09698 -3.32189 1.77509 29.14827 -27.85106 1.29721 26.31449 -24.34718 1.96732
magnitude: 2.95026 au
magnitude: 7.49897 debye
