program: Orca
programVersion: 5.0.2
elementType: Cl Cl O O O N C C C C C C C C C C C C C C C C C C C C C C H H H H H H H H H H H H H H H H H H H
charge: 0
multiplicity: 1
keywords: wb97x-d3
keywords: def2-TZVPP
keywords: def2/J RIJCOSX
keywords: DEFGRID2
keywords: scfconv7
keywords: smallprint printgap noloewdin
keywords: NOSOSCF
formula: C22H19Cl2NO3
InChI: InChI=1/C22H19Cl2NO3/c1-22(2)17(12-19(23)24)20(22)21(26)28-18(13-25)14-7-6-10-16(11-14)27-15-8-4-3-5-9-15/h3-12,17-18,20H,1-2H3
47 atoms
Cl 0.835604 -1.654522 -3.584105
Cl 3.646737 -2.294335 -3.648774
O  -1.270811 -1.532773 0.57682
O  0.144238 -0.562588 2.004386
O  -0.952963 4.23206 0.692573
N  -4.517694 -1.469988 0.011254
C  0.732657 -3.853745 0.450672
C  0.88889 -2.92925 -0.716706
C  0.930584 -2.372808 0.703251
C  -0.60712 -4.518711 0.656538
C  1.885294 -4.734187 0.873306
C  2.107769 -2.859934 -1.531839
C  -0.079214 -1.409703 1.176798
C  2.177128 -2.342028 -2.752137
C  -2.227539 -0.506485 0.819397
C  -1.869633 0.746533 0.058197
C  -3.503674 -1.059758 0.360855
C  -1.619336 1.914581 0.760801
C  -1.729836 0.702258 -1.32447
C  -1.20043 3.045646 0.070588
C  -1.333531 1.844981 -2.000247
C  -1.0568 3.015075 -1.308735
C  -0.387694 4.26916 1.938695
C  0.623105 3.399374 2.327903
C  -0.83053 5.267024 2.79422
C  1.177427 3.531335 3.592962
C  -0.257364 5.394023 4.051048
C  0.742255 4.523638 4.459975
H  -0.031595 -2.724235 -1.250359
H  1.914456 -2.115071 1.07828
H  -0.817696 -4.64738 1.719806
H  -0.588186 -5.512413 0.203419
H  -1.437811 -3.977778 0.208446
H  1.947756 -5.616162 0.233057
H  1.737209 -5.079214 1.898158
H  2.849672 -4.227426 0.841944
H  3.0309 -3.24255 -1.113443
H  -2.32368 -0.293858 1.888408
H  -1.740951 1.93151 1.836676
H  -1.925574 -0.210964 -1.873236
H  -1.22227 1.823755 -3.07613
H  -0.731395 3.902752 -1.836488
H  0.982948 2.626248 1.661193
H  -1.614821 5.941218 2.475592
H  1.962245 2.851548 3.896703
H  -0.60326 6.174948 4.7152
H  1.18206 4.619934 5.443707
elementType: Cl O N C H
totalener: -2050.68340523 hartree
nucrepener: 2802.79289713 hartree
electener: -4853.47630236 hartree
oneelecener: -8380.88862046 hartree
twoeener: 3527.41231810 hartree
cpcmener: -0.03097607 hartree
kineticenergy: 2044.48179081 hartree
xcener: -151.866224766256 hartree
chargesum: 0.0000000
charge: -0.057887 -0.058702 -0.274565 -0.440020 -0.326699 -0.085793 0.093757 0.011440 -0.061508 -0.257322 -0.286222 -0.195626 0.396218 0.047202 0.378906 0.027284 -0.229962 -0.199479 -0.231889 0.292456 -0.123919 -0.226331 0.298754 -0.198343 -0.256576 -0.138592 -0.116249 -0.190098 0.089203 0.099266 0.101170 0.096151 0.092491 0.104835 0.100305 0.093149 0.127090 0.137432 0.145741 0.147086 0.156823 0.148194 0.151853 0.145226 0.158582 0.157504 0.157662
qa: -0.0579 -0.0587 -0.2746 -0.4400 -0.3267 -0.0858 0.0938 0.0114 -0.0615 -0.2573 -0.2862 -0.1956 0.3962 0.0472 0.3789 0.0273 -0.2300 -0.1995 -0.2319 0.2925 -0.1239 -0.2263 0.2988 -0.1983 -0.2566 -0.1386 -0.1162 -0.1901 0.0892 0.0993 0.1012 0.0962 0.0925 0.1048 0.1003 0.0931 0.1271 0.1374 0.1457 0.1471 0.1568 0.1482 0.1519 0.1452 0.1586 0.1575 0.1577
va: 1.2717 1.2467 2.1293 2.0689 2.0875 3.1068 3.7758 3.8539 3.8182 3.9022 3.9213 3.8873 4.1856 4.2142 3.7833 3.5826 4.0619 3.9343 3.9623 3.7237 3.9164 4.0195 3.6848 3.9061 4.0137 3.8890 3.8807 3.9119 1.0338 1.0264 1.0005 0.9999 1.0109 0.9992 1.0007 1.0050 1.0225 1.0175 1.0081 1.0104 0.9917 1.0052 1.0049 1.0086 0.9907 0.9891 0.9905
dispcorr: -0.025452563 hartree
energy: -2050.708857794062
dipole: -3.64769 5.10275 1.45506 -1.92277 1.17131 -0.75146 27.50250 -26.65056 0.85194
magnitude: 1.84599 au
magnitude: 4.69214 debye
