program: Orca
programVersion: 5.0.2
elementType: Cl Cl O O O N C C C C C C C C C C C C C C C C C C C C C C H H H H H H H H H H H H H H H H H H H
charge: 0
multiplicity: 1
keywords: wb97x-d3
keywords: def2-TZVPP
keywords: def2/J RIJCOSX
keywords: DEFGRID2
keywords: scfconv7
keywords: smallprint printgap noloewdin
keywords: NOSOSCF
formula: C22H19Cl2NO3
InChI: InChI=1/C22H19Cl2NO3/c1-22(2)17(12-19(23)24)20(22)21(26)28-18(13-25)14-7-6-10-16(11-14)27-15-8-4-3-5-9-15/h3-12,17-18,20H,1-2H3
47 atoms
Cl 3.841304 -3.4897 1.340441
Cl 3.307544 -5.894325 -0.161071
O  -1.89615 -1.078974 -0.109397
O  -0.116281 -0.136907 0.864739
O  -1.81272 4.52226 0.035414
N  -4.95749 -1.629153 0.972492
C  1.366805 -1.308053 -1.637015
C  1.595729 -2.205394 -0.456552
C  0.180635 -1.804145 -0.830636
C  1.835338 0.122355 -1.527127
C  1.487697 -1.861759 -3.03623
C  1.985556 -3.61205 -0.614661
C  -0.574963 -0.915053 0.068511
C  2.915158 -4.236968 0.096777
C  -2.768615 -0.240995 0.649956
C  -3.007663 1.063451 -0.068344
C  -3.996212 -1.021099 0.817596
C  -2.33472 2.194621 0.371229
C  -3.821698 1.119353 -1.19458
C  -2.450833 3.379384 -0.344708
C  -3.959715 2.318734 -1.874238
C  -3.268062 3.448802 -1.46366
C  -0.547509 4.465791 0.557641
C  -0.244486 5.370489 1.564939
C  0.418833 3.589397 0.076415
C  1.037125 5.396674 2.096132
C  1.691688 3.618569 0.627134
C  2.008004 4.517563 1.637021
H  1.992442 -1.702155 0.417978
H  -0.418491 -2.562387 -1.322079
H  1.196455 0.78844 -2.110382
H  2.846603 0.201086 -1.930926
H  1.867624 0.487026 -0.503329
H  0.971662 -1.210139 -3.743421
H  1.061496 -2.858435 -3.143705
H  2.535813 -1.912117 -3.337379
H  1.477173 -4.197393 -1.371545
H  -2.365267 -0.058701 1.650609
H  -1.71854 2.143875 1.259802
H  -4.350593 0.24041 -1.542572
H  -4.600391 2.374097 -2.74431
H  -3.362788 4.380664 -2.006801
H  -1.005894 6.050799 1.925812
H  0.193229 2.890528 -0.719417
H  1.271611 6.105069 2.880201
H  2.442424 2.933093 0.254494
H  3.003368 4.534398 2.060912
elementType: Cl O N C H
totalener: -2050.68611197 hartree
nucrepener: 2761.75861175 hartree
electener: -4812.44472372 hartree
oneelecener: -8298.57430037 hartree
twoeener: 3486.12957665 hartree
cpcmener: -0.03035599 hartree
kineticenergy: 2044.46659712 hartree
xcener: -151.862859320535 hartree
chargesum: 0.0000000
charge: -0.054917 -0.059084 -0.275219 -0.448117 -0.326512 -0.087347 0.105962 0.037939 -0.102905 -0.283502 -0.262258 -0.206698 0.414866 0.040823 0.398597 0.000419 -0.224169 -0.182327 -0.211997 0.279142 -0.122536 -0.228388 0.297831 -0.250532 -0.212596 -0.120388 -0.138765 -0.188151 0.083706 0.098251 0.103922 0.102471 0.084608 0.099118 0.091447 0.101438 0.130589 0.135373 0.144211 0.142590 0.159771 0.147981 0.145104 0.165202 0.157257 0.160157 0.157636
qa: -0.0549 -0.0591 -0.2752 -0.4481 -0.3265 -0.0873 0.1060 0.0379 -0.1029 -0.2835 -0.2623 -0.2067 0.4149 0.0408 0.3986 0.0004 -0.2242 -0.1823 -0.2120 0.2791 -0.1225 -0.2284 0.2978 -0.2505 -0.2126 -0.1204 -0.1388 -0.1882 0.0837 0.0983 0.1039 0.1025 0.0846 0.0991 0.0914 0.1014 0.1306 0.1354 0.1442 0.1426 0.1598 0.1480 0.1451 0.1652 0.1573 0.1602 0.1576
va: 1.2707 1.2460 2.1352 2.0603 2.0915 3.1102 3.7114 3.8627 3.8762 3.9139 3.9072 3.8965 4.1699 4.2135 3.7447 3.6434 4.0630 3.9154 3.9977 3.7407 3.9085 4.0265 3.7099 4.0059 3.9060 3.8871 3.8851 3.9312 1.0438 1.0334 0.9964 1.0025 1.0156 1.0016 1.0057 1.0012 1.0180 1.0187 1.0164 1.0085 0.9895 1.0053 1.0085 0.9858 0.9888 0.9898 0.9910
dispcorr: -0.025173281 hartree
energy: -2050.711285255889
dipole: -6.84119 7.80775 0.96656 30.21325 -29.30937 0.90388 -14.72792 13.11710 -1.61082
magnitude: 2.08470 au
magnitude: 5.29890 debye
