program: Orca
programVersion: 5.0.2
elementType: Cl Cl O O O N C C C C C C C C C C C C C C C C C C C C C C H H H H H H H H H H H H H H H H H H H
charge: 0
multiplicity: 1
keywords: wb97x-d3
keywords: def2-TZVPP
keywords: def2/J RIJCOSX
keywords: DEFGRID2
keywords: scfconv7
keywords: smallprint printgap noloewdin
keywords: NOSOSCF
formula: C22H19Cl2NO3
InChI: InChI=1/C22H19Cl2NO3/c1-22(2)17(12-19(23)24)20(22)21(26)28-18(13-25)14-7-6-10-16(11-14)27-15-8-4-3-5-9-15/h3-12,17-18,20H,1-2H3
47 atoms
Cl 3.688264 -3.602804 1.478167
Cl 3.35415 -5.841965 -0.313012
O  -1.886183 -1.040003 -0.26542
O  -0.196433 -0.238725 0.962651
O  -1.758057 4.552939 0.449018
N  -5.087902 -1.497858 0.423122
C  1.478933 -1.146474 -1.523798
C  1.634408 -2.14586 -0.41476
C  0.244728 -1.728794 -0.858253
C  1.905161 0.276453 -1.253566
C  1.714653 -1.569824 -2.953486
C  2.059943 -3.527365 -0.671504
C  -0.585971 -0.924608 0.053206
C  2.916621 -4.219529 0.068227
C  -2.805927 -0.228418 0.464445
C  -2.915776 1.140501 -0.160151
C  -4.079072 -0.949989 0.428177
C  -2.29389 2.213783 0.460517
C  -3.578977 1.314682 -1.370886
C  -2.329809 3.463751 -0.144533
C  -3.624285 2.571832 -1.949921
C  -2.993804 3.650553 -1.346112
C  -0.460936 4.482643 0.880452
C  -0.136265 5.217032 2.012775
C  0.51234 3.760191 0.200443
C  1.175017 5.230511 2.464339
C  1.818475 3.777733 0.669268
C  2.157523 4.509984 1.798937
H  1.953776 -1.722654 0.530647
H  -0.304907 -2.442488 -1.461234
H  1.86395 0.548291 -0.201666
H  1.286009 0.980207 -1.813501
H  2.936367 0.412416 -1.584716
H  1.240842 -0.863183 -3.63669
H  1.315837 -2.55719 -3.181181
H  2.782903 -1.580552 -3.177328
H  1.641672 -4.034471 -1.532564
H  -2.511638 -0.146823 1.51484
H  -1.787749 2.078314 1.408493
H  -4.066038 0.479983 -1.860242
H  -4.145405 2.714457 -2.887184
H  -3.019306 4.631724 -1.803022
H  -0.905243 5.775569 2.531803
H  0.267122 3.193841 -0.689522
H  1.425557 5.80466 3.347096
H  2.576647 3.217373 0.136757
H  3.178713 4.52088 2.156243
elementType: Cl O N C H
totalener: -2050.68646729 hartree
nucrepener: 2761.27268332 hartree
electener: -4811.95915061 hartree
oneelecener: -8297.62825953 hartree
twoeener: 3485.66910891 hartree
cpcmener: -0.03078880 hartree
kineticenergy: 2044.47206793 hartree
xcener: -151.863047599589 hartree
chargesum: -0.0000000
charge: -0.055030 -0.059394 -0.276282 -0.446051 -0.330561 -0.087209 0.108241 0.036760 -0.093935 -0.293622 -0.264536 -0.206238 0.407157 0.040814 0.403218 -0.011127 -0.224797 -0.141733 -0.194922 0.225518 -0.138044 -0.201725 0.270736 -0.241005 -0.181259 -0.124477 -0.157421 -0.184356 0.082756 0.098265 0.092286 0.104835 0.102424 0.099099 0.091782 0.101906 0.130146 0.135574 0.146000 0.143141 0.160005 0.148954 0.144906 0.159560 0.157102 0.165217 0.157320
qa: -0.0550 -0.0594 -0.2763 -0.4461 -0.3306 -0.0872 0.1082 0.0368 -0.0939 -0.2936 -0.2645 -0.2062 0.4072 0.0408 0.4032 -0.0111 -0.2248 -0.1417 -0.1949 0.2255 -0.1380 -0.2017 0.2707 -0.2410 -0.1813 -0.1245 -0.1574 -0.1844 0.0828 0.0983 0.0923 0.1048 0.1024 0.0991 0.0918 0.1019 0.1301 0.1356 0.1460 0.1431 0.1600 0.1490 0.1449 0.1596 0.1571 0.1652 0.1573
va: 1.2705 1.2454 2.1348 2.0640 2.0745 3.1107 3.7197 3.8649 3.8684 3.9113 3.9057 3.8975 4.1802 4.2133 3.7343 3.6404 4.0655 3.9185 3.9834 3.7752 3.9152 4.0183 3.7200 3.9987 3.8773 3.8972 3.8920 3.9187 1.0458 1.0330 1.0136 0.9956 1.0019 1.0015 1.0060 1.0011 1.0184 1.0188 1.0171 1.0081 0.9899 1.0036 1.0084 0.9934 0.9887 0.9869 0.9910
dispcorr: -0.025166524 hartree
energy: -2050.711633810196
dipole: -5.05276 6.18727 1.13451 31.69722 -30.71871 0.97850 -13.55816 11.98699 -1.57117
magnitude: 2.17098 au
magnitude: 5.51820 debye
