program: Orca
programVersion: 5.0.2
elementType: Cl Cl O O O N C C C C C C C C C C C C C C C C C C C C C C H H H H H H H H H H H H H H H H H H H
charge: 0
multiplicity: 1
keywords: wb97x-d3
keywords: def2-TZVPP
keywords: def2/J RIJCOSX
keywords: DEFGRID2
keywords: scfconv7
keywords: smallprint printgap noloewdin
keywords: NOSOSCF
formula: C22H19Cl2NO3
InChI: InChI=1/C22H19Cl2NO3/c1-22(2)17(12-19(23)24)20(22)21(26)28-18(13-25)14-7-6-10-16(11-14)27-15-8-4-3-5-9-15/h3-12,17-18,20H,1-2H3
47 atoms
Cl 1.288811 -4.177697 1.585583
Cl 2.186451 -6.653942 0.402758
O  -0.965357 -1.049183 0.188716
O  1.080712 -0.204951 -0.115755
O  -0.930111 4.734362 -0.792939
N  -3.365506 -0.561013 2.394166
C  1.224633 -2.376994 -2.386432
C  1.902454 -2.897255 -1.16618
C  0.502381 -2.339306 -1.045833
C  1.744336 -1.113785 -3.025199
C  0.655913 -3.359111 -3.38144
C  2.126928 -4.34486 -0.957426
C  0.28607 -1.090843 -0.300738
C  1.892496 -4.972638 0.185657
C  -1.340584 0.128177 0.892652
C  -1.741285 1.240461 -0.047208
C  -2.476011 -0.273084 1.727418
C  -1.118984 2.476124 0.054354
C  -2.723268 1.012951 -1.004961
C  -1.511363 3.503881 -0.796108
C  -3.086582 2.041034 -1.85899
C  -2.49338 3.289381 -1.753417
C  -0.422483 5.28936 0.350111
C  -1.083391 5.222436 1.570487
C  0.762081 6.000492 0.222753
C  -0.536252 5.868611 2.669965
C  1.288723 6.653643 1.327448
C  0.647139 6.585808 2.55616
H  2.683133 -2.258097 -0.759631
H  -0.296135 -3.065038 -0.943483
H  2.47187 -1.374148 -3.797167
H  2.24153 -0.447609 -2.323442
H  0.93764 -0.558252 -3.507011
H  0.252517 -4.254585 -2.907223
H  1.423032 -3.674597 -4.091559
H  -0.151866 -2.897322 -3.951783
H  2.52996 -4.926102 -1.779286
H  -0.543316 0.461415 1.565046
H  -0.338569 2.627162 0.790039
H  -3.206726 0.047056 -1.084447
H  -3.850166 1.876152 -2.607512
H  -2.785262 4.096088 -2.414025
H  -2.017019 4.682905 1.669847
H  1.262102 6.046096 -0.736498
H  -1.04972 5.816686 3.621355
H  2.210755 7.211113 1.225089
H  1.063002 7.091185 3.417754
elementType: Cl O N C H
totalener: -2050.68449346 hartree
nucrepener: 2726.37539857 hartree
electener: -4777.05989202 hartree
oneelecener: -8228.42506945 hartree
twoeener: 3451.36517743 hartree
cpcmener: -0.03002147 hartree
kineticenergy: 2044.48033714 hartree
xcener: -151.864120080202 hartree
chargesum: 0.0000000
charge: -0.049100 -0.055106 -0.278670 -0.445485 -0.322930 -0.087562 0.130784 -0.023365 -0.148953 -0.271588 -0.278638 -0.221680 0.402085 0.078172 0.408209 0.010766 -0.225323 -0.191878 -0.227535 0.287950 -0.124851 -0.230828 0.303563 -0.212963 -0.256969 -0.135420 -0.114879 -0.189612 0.113312 0.115164 0.096894 0.095568 0.100729 0.093785 0.101556 0.100349 0.140221 0.135739 0.145188 0.147714 0.158629 0.148263 0.158181 0.145908 0.159249 0.157746 0.157610
qa: -0.0491 -0.0551 -0.2787 -0.4455 -0.3229 -0.0876 0.1308 -0.0234 -0.1490 -0.2716 -0.2786 -0.2217 0.4021 0.0782 0.4082 0.0108 -0.2253 -0.1919 -0.2275 0.2880 -0.1249 -0.2308 0.3036 -0.2130 -0.2570 -0.1354 -0.1149 -0.1896 0.1133 0.1152 0.0969 0.0956 0.1007 0.0938 0.1016 0.1003 0.1402 0.1357 0.1452 0.1477 0.1586 0.1483 0.1582 0.1459 0.1592 0.1577 0.1576
va: 1.2813 1.2506 2.1233 2.0689 2.0904 3.1124 3.7195 3.8742 3.8542 3.8921 3.9168 3.9079 4.1442 4.1852 3.7368 3.6128 4.0751 3.9498 3.9814 3.7382 3.9160 4.0096 3.6759 3.9262 4.0168 3.8843 3.8792 3.9121 1.0215 1.0233 1.0011 1.0183 0.9991 0.9991 1.0001 1.0029 1.0086 1.0205 1.0101 1.0103 0.9897 1.0059 0.9964 1.0087 0.9901 0.9891 0.9908
dispcorr: -0.023996003 hartree
energy: -2050.708489461003
dipole: -2.02738 2.96858 0.94120 30.09349 -29.74617 0.34732 -20.11753 18.24402 -1.87350
magnitude: 2.12521 au
magnitude: 5.40185 debye
