program: Orca
programVersion: 5.0.2
elementType: Cl Cl O O O N C C C C C C C C C C C C C C C C C C C C C C H H H H H H H H H H H H H H H H H H H
charge: 0
multiplicity: 1
keywords: wb97x-d3
keywords: def2-TZVPP
keywords: def2/J RIJCOSX
keywords: DEFGRID2
keywords: scfconv7
keywords: smallprint printgap noloewdin
keywords: NOSOSCF
formula: C22H19Cl2NO3
InChI: InChI=1/C22H19Cl2NO3/c1-22(2)17(12-19(23)24)20(22)21(26)28-18(13-25)14-7-6-10-16(11-14)27-15-8-4-3-5-9-15/h3-12,17-18,20H,1-2H3
47 atoms
Cl -0.527657 -5.149721 0.770075
Cl 0.925508 -7.404479 -0.302853
O  -1.023094 -1.116338 -0.753098
O  0.402525 -1.104403 0.966006
O  -0.445037 4.224368 1.741759
N  -4.008435 0.135738 -1.401209
C  2.238591 -2.447074 -1.251901
C  1.817476 -3.428121 -0.212489
C  0.76433 -2.583318 -0.884584
C  3.022426 -1.228823 -0.830914
C  2.600558 -2.950259 -2.627303
C  1.841084 -4.887553 -0.452888
C  0.073262 -1.547531 -0.103631
C  0.879519 -5.704164 -0.048171
C  -1.721133 -0.038074 -0.151622
C  -0.980372 1.275349 -0.278004
C  -2.999009 0.039192 -0.862162
C  -1.039219 2.181871 0.768447
C  -0.280271 1.580669 -1.438989
C  -0.384429 3.401501 0.658038
C  0.381094 2.795644 -1.527485
C  0.339592 3.711305 -0.486637
C  -0.423047 5.584793 1.577483
C  -1.234706 6.222196 0.646869
C  0.397544 6.315938 2.423013
C  -1.209205 7.606483 0.563831
C  0.403306 7.701386 2.337079
C  -0.392952 8.351629 1.405052
H  2.039262 -3.142025 0.813124
H  0.152534 -3.065679 -1.638531
H  2.793875 -0.375525 -1.472276
H  4.090697 -1.432534 -0.924107
H  2.83878 -0.933758 0.200032
H  1.990732 -3.798623 -2.93975
H  3.646564 -3.261845 -2.657995
H  2.470127 -2.160583 -3.369115
H  2.698948 -5.320503 -0.955016
H  -1.94371 -0.246265 0.900405
H  -1.586027 1.944252 1.673482
H  -0.241577 0.885134 -2.267442
H  0.941445 3.037612 -2.420954
H  0.871896 4.649696 -0.573641
H  -1.884499 5.651362 -0.005062
H  1.021342 5.80438 3.145434
H  -1.839944 8.104275 -0.161481
H  1.041384 8.271908 2.999613
H  -0.381497 9.43144 1.336408
elementType: Cl O N C H
totalener: -2050.68434966 hartree
nucrepener: 2694.64778307 hartree
electener: -4745.33213272 hartree
oneelecener: -8164.94795926 hartree
twoeener: 3419.61582653 hartree
cpcmener: -0.03118676 hartree
kineticenergy: 2044.48564862 hartree
xcener: -151.865433373632 hartree
chargesum: 0.0000000
charge: -0.050254 -0.055112 -0.279270 -0.433421 -0.325057 -0.087236 0.136916 -0.028577 -0.134596 -0.267936 -0.281888 -0.219508 0.374178 0.074908 0.406543 0.041134 -0.226459 -0.238824 -0.233621 0.262345 -0.138842 -0.168567 0.266165 -0.182505 -0.237551 -0.146485 -0.125829 -0.177178 0.112563 0.115329 0.096193 0.100384 0.095622 0.095140 0.102081 0.099775 0.140666 0.140785 0.133374 0.147942 0.160269 0.157136 0.157441 0.146883 0.159516 0.157216 0.158212
qa: -0.0503 -0.0551 -0.2793 -0.4334 -0.3251 -0.0872 0.1369 -0.0286 -0.1346 -0.2679 -0.2819 -0.2195 0.3742 0.0749 0.4065 0.0411 -0.2265 -0.2388 -0.2336 0.2623 -0.1388 -0.1686 0.2662 -0.1825 -0.2376 -0.1465 -0.1258 -0.1772 0.1126 0.1153 0.0962 0.1004 0.0956 0.0951 0.1021 0.0998 0.1407 0.1408 0.1334 0.1479 0.1603 0.1571 0.1574 0.1469 0.1595 0.1572 0.1582
va: 1.2801 1.2511 2.1156 2.0763 2.0775 3.1138 3.7226 3.8777 3.8189 3.8899 3.9141 3.9060 4.1826 4.1873 3.7161 3.6176 4.0743 4.0962 3.9574 3.7656 3.9165 3.9069 3.6997 3.9143 4.0060 3.8918 3.8869 3.8998 1.0235 1.0236 1.0013 1.0024 1.0162 0.9990 0.9997 1.0031 1.0080 1.0191 1.0185 1.0129 0.9909 0.9958 0.9963 1.0072 0.9902 0.9895 0.9904
dispcorr: -0.024416463 hartree
energy: -2050.708766119531
dipole: 16.66424 -14.27219 2.39205 39.55029 -38.72049 0.82980 -8.79156 8.00563 -0.78593
magnitude: 2.65107 au
magnitude: 6.73848 debye
