program: Orca
programVersion: 5.0.2
elementType: Cl Cl O O O N C C C C C C C C C C C C C C C C C C C C C C H H H H H H H H H H H H H H H H H H H
charge: 0
multiplicity: 1
keywords: wb97x-d3
keywords: def2-TZVPP
keywords: def2/J RIJCOSX
keywords: DEFGRID2
keywords: scfconv7
keywords: smallprint printgap noloewdin
keywords: NOSOSCF
formula: C22H19Cl2NO3
InChI: InChI=1/C22H19Cl2NO3/c1-22(2)17(12-19(23)24)20(22)21(26)28-18(13-25)14-7-6-10-16(11-14)27-15-8-4-3-5-9-15/h3-12,17-18,20H,1-2H3
47 atoms
Cl 2.191874 -0.021093 -1.708339
Cl 4.285928 -0.136709 0.271606
O  -2.066268 -2.007775 -0.144646
O  -2.203912 -1.909068 2.079751
O  -0.560827 2.756786 -0.933121
N  -4.096683 -1.539376 -2.701898
C  0.464639 -3.694195 0.23564
C  0.811039 -2.248425 0.031814
C  -0.17524 -2.649269 1.123406
C  -0.311695 -4.399429 -0.849331
C  1.447438 -4.607921 0.93018
C  2.102831 -1.674229 0.423424
C  -1.568799 -2.173368 1.091146
C  2.757938 -0.734919 -0.248553
C  -3.258493 -1.239023 -0.246025
C  -2.982246 0.2202 0.034705
C  -3.721601 -1.42493 -1.622386
C  -1.900753 0.835114 -0.587942
C  -3.766272 0.924528 0.934549
C  -1.613899 2.155393 -0.295542
C  -3.473835 2.254918 1.206047
C  -2.395172 2.876316 0.598392
C  0.599469 2.967157 -0.243317
C  0.881494 2.373014 0.980857
C  1.524853 3.81112 -0.847887
C  2.098019 2.638471 1.597097
C  2.734278 4.061519 -0.220271
C  3.027616 3.481637 1.007751
H  0.357472 -1.803749 -0.845591
H  0.212032 -2.629042 2.135897
H  0.385979 -4.9099 -1.515886
H  -0.912225 -3.732148 -1.462354
H  -0.971615 -5.157753 -0.423466
H  2.213904 -4.947547 0.231111
H  0.932158 -5.49121 1.311431
H  1.95075 -4.139064 1.775094
H  2.566556 -2.034379 1.333911
H  -4.041154 -1.618688 0.418313
H  -1.276749 0.298038 -1.293035
H  -4.599237 0.439188 1.427169
H  -4.085458 2.808148 1.906243
H  -2.160818 3.911254 0.814769
H  0.176863 1.705796 1.460265
H  1.295472 4.263395 -1.80506
H  2.314292 2.174983 2.551242
H  3.450611 4.719442 -0.695703
H  3.971495 3.683345 1.496725
elementType: Cl O N C H
totalener: -2050.68281964 hartree
nucrepener: 2959.31091509 hartree
electener: -5009.99373473 hartree
oneelecener: -8694.19042949 hartree
twoeener: 3684.19669476 hartree
cpcmener: -0.03273580 hartree
kineticenergy: 2044.46572910 hartree
xcener: -151.864353385038 hartree
chargesum: -0.0000000
charge: -0.060205 -0.063367 -0.281526 -0.429981 -0.323682 -0.084245 0.090874 0.035289 -0.056378 -0.259035 -0.273082 -0.215637 0.368018 0.070241 0.389733 -0.015822 -0.233133 -0.171355 -0.159832 0.176780 -0.134133 -0.139369 0.280378 -0.164529 -0.239623 -0.192711 -0.117408 -0.188387 0.085708 0.095998 0.095893 0.093072 0.100737 0.102119 0.099845 0.091713 0.127422 0.141835 0.138132 0.146503 0.160340 0.156815 0.146207 0.142651 0.155673 0.156298 0.155167
qa: -0.0602 -0.0634 -0.2815 -0.4300 -0.3237 -0.0842 0.0909 0.0353 -0.0564 -0.2590 -0.2731 -0.2156 0.3680 0.0702 0.3897 -0.0158 -0.2331 -0.1714 -0.1598 0.1768 -0.1341 -0.1394 0.2804 -0.1645 -0.2396 -0.1927 -0.1174 -0.1884 0.0857 0.0960 0.0959 0.0931 0.1007 0.1021 0.0998 0.0917 0.1274 0.1418 0.1381 0.1465 0.1603 0.1568 0.1462 0.1427 0.1557 0.1563 0.1552
va: 1.2639 1.2367 2.1170 2.0781 2.0658 3.1069 3.7563 3.8415 3.8322 3.9033 3.9198 3.9248 4.2087 4.1778 3.7689 3.6343 4.0718 4.0065 3.9494 3.8318 3.8926 3.9594 3.6516 3.7862 3.9796 3.8908 3.8984 3.8745 1.0280 1.0284 1.0000 1.0117 1.0005 1.0003 1.0011 1.0056 1.0218 1.0145 1.0199 1.0017 0.9895 0.9955 1.0067 1.0096 0.9934 0.9883 0.9906
dispcorr: -0.029689958 hartree
energy: -2050.712509597608
dipole: -7.70520 8.32647 0.62127 -11.02209 10.33677 -0.68532 10.32809 -8.58308 1.74502
magnitude: 1.97502 au
magnitude: 5.02011 debye
