program: Orca
programVersion: 5.0.2
elementType: Cl Cl O O O N C C C C C C C C C C C C C C C C C C C C C C H H H H H H H H H H H H H H H H H H H
charge: 0
multiplicity: 1
keywords: wb97x-d3
keywords: def2-TZVPP
keywords: def2/J RIJCOSX
keywords: DEFGRID2
keywords: scfconv7
keywords: smallprint printgap noloewdin
keywords: NOSOSCF
formula: C22H19Cl2NO3
InChI: InChI=1/C22H19Cl2NO3/c1-22(2)17(12-19(23)24)20(22)21(26)28-18(13-25)14-7-6-10-16(11-14)27-15-8-4-3-5-9-15/h3-12,17-18,20H,1-2H3
47 atoms
Cl 0.777978 -5.983937 -1.735377
Cl 2.578615 -5.174141 -3.838948
O  -0.771666 -0.169349 -0.189113
O  -0.98813 -2.07137 0.955798
O  -1.593287 5.153882 1.177059
N  -4.045014 -1.104956 -0.280624
C  2.116605 -2.222652 0.439366
C  1.400206 -3.139822 -0.506778
C  0.962962 -1.689798 -0.390157
C  1.95237 -2.471504 1.918505
C  3.482756 -1.686255 0.085193
C  2.007037 -3.580517 -1.768187
C  -0.345953 -1.379872 0.207826
C  1.809308 -4.753715 -2.355513
C  -1.965847 0.330859 0.401424
C  -2.123686 1.753618 -0.070437
C  -3.120168 -0.493236 0.018882
C  -1.795432 2.782272 0.800646
C  -2.532904 2.030543 -1.370048
C  -1.866822 4.098253 0.358895
C  -2.617735 3.347994 -1.789352
C  -2.279473 4.385655 -0.9335
C  -0.546103 5.090757 2.057498
C  -0.737863 5.660299 3.308077
C  0.681451 4.540386 1.707922
C  0.310918 5.680466 4.21637
C  1.716592 4.556763 2.63145
C  1.53914 5.124645 3.88616
H  0.734002 -3.849581 -0.02948
H  1.251445 -1.031869 -1.202036
H  2.768408 -3.104899 2.271135
H  1.021156 -2.971572 2.17383
H  1.999601 -1.534784 2.477178
H  4.252099 -2.43255 0.291793
H  3.706178 -0.805408 0.689415
H  3.574091 -1.390622 -0.959223
H  2.672576 -2.892752 -2.276076
H  -1.895284 0.302057 1.493406
H  -1.487639 2.554938 1.814371
H  -2.78929 1.230347 -2.053467
H  -2.939737 3.572806 -2.79744
H  -2.3391 5.414819 -1.264398
H  -1.698954 6.08827 3.564613
H  0.838147 4.106816 0.727862
H  0.16061 6.127481 5.190638
H  2.672433 4.127328 2.360034
H  2.353034 5.136259 4.599123
elementType: Cl O N C H
totalener: -2050.68696392 hartree
nucrepener: 2668.95246091 hartree
electener: -4719.63942482 hartree
oneelecener: -8112.95334761 hartree
twoeener: 3393.31392278 hartree
cpcmener: -0.03415531 hartree
kineticenergy: 2044.46749115 hartree
xcener: -151.861839829392 hartree
chargesum: 0.0000000
charge: -0.053812 -0.060043 -0.271401 -0.440743 -0.327471 -0.088523 0.084894 0.026838 -0.070427 -0.266871 -0.269672 -0.198656 0.395106 0.041144 0.410417 0.002523 -0.235874 -0.169147 -0.206735 0.242563 -0.134708 -0.209437 0.274226 -0.246927 -0.183395 -0.119703 -0.145599 -0.185972 0.082864 0.096537 0.098956 0.095985 0.100511 0.103199 0.097942 0.092446 0.127587 0.131317 0.147390 0.145729 0.159021 0.148642 0.146690 0.156376 0.158110 0.159908 0.158196
qa: -0.0538 -0.0600 -0.2714 -0.4407 -0.3275 -0.0885 0.0849 0.0268 -0.0704 -0.2669 -0.2697 -0.1987 0.3951 0.0411 0.4104 0.0025 -0.2359 -0.1691 -0.2067 0.2426 -0.1347 -0.2094 0.2742 -0.2469 -0.1834 -0.1197 -0.1456 -0.1860 0.0829 0.0965 0.0990 0.0960 0.1005 0.1032 0.0979 0.0924 0.1276 0.1313 0.1474 0.1457 0.1590 0.1486 0.1467 0.1564 0.1581 0.1599 0.1582
va: 1.2721 1.2446 2.1628 2.0661 2.0781 3.1108 3.7449 3.8744 3.8501 3.9044 3.9105 3.8982 4.1756 4.2170 3.7318 3.7168 4.0169 3.9323 3.9860 3.7724 3.9255 4.0085 3.6999 4.0082 3.9044 3.8862 3.8944 3.9069 1.0462 1.0311 1.0001 1.0180 0.9993 1.0001 1.0013 1.0061 1.0205 1.0151 1.0044 1.0081 0.9903 1.0048 1.0077 0.9971 0.9890 0.9901 0.9905
dispcorr: -0.022308535 hartree
energy: -2050.709272451547
dipole: 9.35046 -6.70992 2.64054 32.86426 -30.59055 2.27371 23.48335 -22.85211 0.63124
magnitude: 3.54128 au
magnitude: 9.00123 debye
