program: Orca
programVersion: 5.0.2
elementType: Cl Cl O O O N C C C C C C C C C C C C C C C C C C C C C C H H H H H H H H H H H H H H H H H H H
charge: 0
multiplicity: 1
keywords: wb97x-d3
keywords: def2-TZVPP
keywords: def2/J RIJCOSX
keywords: DEFGRID2
keywords: scfconv7
keywords: smallprint printgap noloewdin
keywords: NOSOSCF
formula: C22H19Cl2NO3
InChI: InChI=1/C22H19Cl2NO3/c1-22(2)17(12-19(23)24)20(22)21(26)28-18(13-25)14-7-6-10-16(11-14)27-15-8-4-3-5-9-15/h3-12,17-18,20H,1-2H3
47 atoms
Cl 2.442594 0.165735 2.381717
Cl 4.046186 -2.035484 3.324035
O  -1.593411 -1.328728 0.07185
O  -2.227977 -3.450247 -0.1897
O  -1.136666 3.641565 -0.919626
N  -3.594368 -1.353212 -2.661221
C  1.095377 -2.583868 -0.925836
C  1.153391 -1.974477 0.448779
C  0.07645 -2.98806 0.122352
C  0.702072 -1.682955 -2.071959
C  2.089602 -3.64494 -1.330838
C  2.200904 -2.343219 1.40804
C  -1.352423 -2.642618 -0.00979
C  2.805477 -1.513536 2.248957
C  -2.915641 -0.875284 -0.177647
C  -2.933669 0.610202 0.079007
C  -3.2865 -1.164345 -1.570421
C  -2.025171 1.423752 -0.589135
C  -3.829698 1.145182 0.99072
C  -1.997846 2.781341 -0.309704
C  -3.812891 2.512991 1.234374
C  -2.896502 3.331867 0.598892
C  0.06716 3.182919 -1.392556
C  0.936619 2.463818 -0.581285
C  0.413725 3.50711 -2.694724
C  2.157992 2.054618 -1.095077
C  1.64665 3.104847 -3.191239
C  2.517911 2.371757 -2.398858
H  0.825527 -0.942959 0.494398
H  0.212808 -3.988407 0.518502
H  1.599673 -1.268884 -2.535169
H  0.081092 -0.841224 -1.771513
H  0.164871 -2.24372 -2.839534
H  3.036611 -3.18961 -1.62666
H  1.710401 -4.203976 -2.188058
H  2.296479 -4.367634 -0.542445
H  2.519136 -3.378512 1.438857
H  -3.63711 -1.380328 0.47176
H  -1.345112 0.998213 -1.317494
H  -4.531653 0.505064 1.509497
H  -4.509722 2.94282 1.941629
H  -2.872719 4.394955 0.802635
H  0.666886 2.224219 0.440082
H  -0.272868 4.072543 -3.31243
H  2.835877 1.490874 -0.467201
H  1.919761 3.361074 -4.206804
H  3.474695 2.053613 -2.791344
elementType: Cl O N C H
totalener: -2050.68467574 hartree
nucrepener: 2887.83119224 hartree
electener: -4938.51586798 hartree
oneelecener: -8550.37394597 hartree
twoeener: 3611.85807799 hartree
cpcmener: -0.03361143 hartree
kineticenergy: 2044.46127846 hartree
xcener: -151.862865817036 hartree
chargesum: -0.0000000
charge: -0.064074 -0.060404 -0.264139 -0.429349 -0.325596 -0.081608 0.114264 0.073938 -0.101970 -0.257089 -0.274117 -0.221957 0.397343 0.060618 0.375021 0.004319 -0.226991 -0.218833 -0.198064 0.249695 -0.110518 -0.229621 0.275972 -0.177434 -0.237143 -0.133056 -0.118417 -0.186676 0.062075 0.101379 0.101006 0.052395 0.111498 0.101824 0.099998 0.092105 0.127593 0.132630 0.177913 0.146905 0.158938 0.147111 0.149566 0.145581 0.141293 0.157980 0.158097
qa: -0.0641 -0.0604 -0.2641 -0.4293 -0.3256 -0.0816 0.1143 0.0739 -0.1020 -0.2571 -0.2741 -0.2220 0.3973 0.0606 0.3750 0.0043 -0.2270 -0.2188 -0.1981 0.2497 -0.1105 -0.2296 0.2760 -0.1774 -0.2371 -0.1331 -0.1184 -0.1867 0.0621 0.1014 0.1010 0.0524 0.1115 0.1018 0.1000 0.0921 0.1276 0.1326 0.1779 0.1469 0.1589 0.1471 0.1496 0.1456 0.1413 0.1580 0.1581
va: 1.2682 1.2449 2.1605 2.0753 2.0914 3.1059 3.7126 3.8393 3.8801 3.9251 3.9121 3.8886 4.2012 4.1823 3.7955 3.7106 4.0163 3.9271 3.9513 3.8061 3.9050 4.0085 3.7407 3.8787 4.0122 3.8261 3.8800 3.9366 1.0310 1.0276 1.0024 1.0114 1.0063 1.0002 1.0008 1.0058 1.0202 1.0186 0.9777 1.0016 0.9893 1.0062 0.9995 1.0073 1.0076 0.9884 0.9909
dispcorr: -0.028033678 hartree
energy: -2050.712709420753
dipole: -5.55222 6.66773 1.11551 -0.23286 0.60679 0.37393 -22.59706 23.46139 0.86433
magnitude: 1.45988 au
magnitude: 3.71072 debye
