program: Orca
programVersion: 5.0.2
elementType: Cl Cl O O O N C C C C C C C C C C C C C C C C C C C C C C H H H H H H H H H H H H H H H H H H H
charge: 0
multiplicity: 1
keywords: wb97x-d3
keywords: def2-TZVPP
keywords: def2/J RIJCOSX
keywords: DEFGRID2
keywords: scfconv7
keywords: smallprint printgap noloewdin
keywords: NOSOSCF
formula: C22H19Cl2NO3
InChI: InChI=1/C22H19Cl2NO3/c1-22(2)17(12-19(23)24)20(22)21(26)28-18(13-25)14-7-6-10-16(11-14)27-15-8-4-3-5-9-15/h3-12,17-18,20H,1-2H3
47 atoms
Cl 4.088801 -3.223018 1.105827
Cl 3.486323 -5.857375 0.098523
O  -1.923519 -1.225434 0.157451
O  -0.061671 -0.122251 0.718661
O  -1.921254 4.495421 -0.069629
N  -4.975302 -1.419699 1.403439
C  1.074406 -1.648647 -1.769184
C  1.539211 -2.325048 -0.512229
C  0.062191 -2.042514 -0.709186
C  1.454026 -0.201684 -1.971804
C  1.010581 -2.424215 -3.06248
C  1.98453 -3.724373 -0.505241
C  -0.59512 -1.027674 0.131031
C  3.042702 -4.193303 0.143791
C  -2.70421 -0.253944 0.850357
C  -2.912993 0.976256 0.002199
C  -3.971784 -0.921889 1.151632
C  -2.342923 2.174568 0.4018
C  -3.61504 0.891229 -1.195824
C  -2.457264 3.290489 -0.418224
C  -3.746174 2.019928 -1.987206
C  -3.160846 3.220455 -1.610352
C  -0.663062 4.552181 0.467544
C  -0.430255 5.542037 1.411821
C  0.360159 3.702726 0.062867
C  0.837591 5.680181 1.957721
C  1.619332 3.845861 0.627784
C  1.865311 4.829464 1.575864
H  2.036324 -1.668605 0.193095
H  -0.562542 -2.891026 -0.964661
H  1.667561 0.324243 -1.044525
H  0.66492 0.339745 -2.497418
H  2.353381 -0.148171 -2.58732
H  1.9998 -2.483303 -3.520182
H  0.348691 -1.920594 -3.769022
H  0.638117 -3.440337 -2.938666
H  1.405228 -4.443107 -1.072641
H  -2.24317 0.013736 1.806295
H  -1.805621 2.232125 1.340385
H  -4.060531 -0.044061 -1.512069
H  -4.296825 1.965151 -2.916681
H  -3.249645 4.098109 -2.238128
H  -1.235937 6.199163 1.713854
H  0.189871 2.937109 -0.683911
H  1.016888 6.453416 2.693419
H  2.414387 3.18135 0.315599
H  2.850493 4.934095 2.010609
elementType: Cl O N C H
totalener: -2050.68659931 hartree
nucrepener: 2753.06497325 hartree
electener: -4803.75157256 hartree
oneelecener: -8281.27664398 hartree
twoeener: 3477.52507142 hartree
cpcmener: -0.03087836 hartree
kineticenergy: 2044.47848731 hartree
xcener: -151.864644808607 hartree
chargesum: -0.0000000
charge: -0.054975 -0.058840 -0.276264 -0.445470 -0.329038 -0.087395 0.097025 0.034030 -0.086810 -0.272349 -0.264884 -0.206602 0.396363 0.039950 0.409584 0.005519 -0.227639 -0.176588 -0.214611 0.260787 -0.129530 -0.214337 0.286848 -0.246136 -0.192239 -0.123232 -0.151269 -0.182897 0.083460 0.097732 0.090456 0.102134 0.100743 0.101978 0.099624 0.090687 0.130864 0.135394 0.145951 0.146398 0.159407 0.148462 0.145801 0.158230 0.157353 0.158610 0.157718
qa: -0.0550 -0.0588 -0.2763 -0.4455 -0.3290 -0.0874 0.0970 0.0340 -0.0868 -0.2723 -0.2649 -0.2066 0.3964 0.0400 0.4096 0.0055 -0.2276 -0.1766 -0.2146 0.2608 -0.1295 -0.2143 0.2868 -0.2461 -0.1922 -0.1232 -0.1513 -0.1829 0.0835 0.0977 0.0905 0.1021 0.1007 0.1020 0.0996 0.0907 0.1309 0.1354 0.1460 0.1464 0.1594 0.1485 0.1458 0.1582 0.1574 0.1586 0.1577
va: 1.2707 1.2459 2.1375 2.0644 2.0843 3.1118 3.7170 3.8712 3.8598 3.9146 3.9084 3.8966 4.1871 4.2133 3.7377 3.5939 4.0691 3.9257 3.9866 3.7475 3.9107 4.0186 3.7040 4.0015 3.8894 3.8900 3.9004 3.9101 1.0449 1.0329 1.0149 0.9980 1.0019 1.0009 1.0010 1.0059 1.0176 1.0181 1.0113 1.0083 0.9897 1.0044 1.0082 0.9930 0.9890 0.9909 0.9905
dispcorr: -0.024762687 hartree
energy: -2050.711361995230
dipole: -9.96072 10.79555 0.83483 27.33297 -26.82892 0.50405 -16.29695 14.62274 -1.67420
magnitude: 1.93752 au
magnitude: 4.92477 debye
