program: Orca
programVersion: 5.0.2
elementType: Cl Cl O O O N C C C C C C C C C C C C C C C C C C C C C C H H H H H H H H H H H H H H H H H H H
charge: 0
multiplicity: 1
keywords: wb97x-d3
keywords: def2-TZVPP
keywords: def2/J RIJCOSX
keywords: DEFGRID2
keywords: scfconv7
keywords: smallprint printgap noloewdin
keywords: NOSOSCF
formula: C22H19Cl2NO3
InChI: InChI=1/C22H19Cl2NO3/c1-22(2)17(12-19(23)24)20(22)21(26)28-18(13-25)14-7-6-10-16(11-14)27-15-8-4-3-5-9-15/h3-12,17-18,20H,1-2H3
47 atoms
Cl 4.372755 -2.862356 0.440674
Cl 3.848885 -5.694406 0.275789
O  -1.826343 -1.305874 0.520076
O  0.100366 -0.172926 0.476834
O  -1.865557 4.481144 -0.336857
N  -4.769153 -1.059282 1.978762
C  0.57217 -2.261028 -1.881969
C  1.452031 -2.542844 -0.697154
C  -0.03625 -2.360822 -0.494881
C  0.722451 -0.9209 -2.558423
C  0.210775 -3.369267 -2.840007
C  2.033509 -3.868345 -0.454362
C  -0.527407 -1.164477 0.210108
C  3.248986 -4.098813 0.025506
C  -2.468631 -0.17958 1.107006
C  -2.664857 0.933423 0.10421
C  -3.752599 -0.688823 1.593343
C  -2.178502 2.198328 0.396692
C  -3.285924 0.670625 -1.110839
C  -2.291979 3.206238 -0.552863
C  -3.407487 1.691049 -2.040581
C  -2.904751 2.954946 -1.773152
C  -0.773793 4.758215 0.439961
C  -0.827601 5.931735 1.180184
C  0.366711 3.963558 0.45478
C  0.26721 6.31126 1.942363
C  1.448687 4.349921 1.234004
C  1.407545 5.520546 1.97899
H  2.057137 -1.70133 -0.379881
H  -0.619915 -3.257621 -0.319332
H  -0.226062 -0.5956 -2.99087
H  1.444135 -1.004213 -3.37317
H  1.076866 -0.136808 -1.892173
H  -0.685455 -3.100718 -3.402106
H  0.007782 -4.317651 -2.343818
H  1.015447 -3.532942 -3.559351
H  1.424437 -4.737433 -0.67297
H  -1.910538 0.184304 1.975815
H  -1.707076 2.382745 1.35401
H  -3.670037 -0.316736 -1.336035
H  -3.88892 1.500961 -2.990697
H  -2.987833 3.7472 -2.506495
H  -1.719523 6.545128 1.151849
H  0.423494 3.051449 -0.12621
H  0.22217 7.229404 2.51384
H  2.33402 3.72741 1.25048
H  2.257181 5.815107 2.580782
elementType: Cl O N C H
totalener: -2050.68618897 hartree
nucrepener: 2733.32072844 hartree
electener: -4784.00691741 hartree
oneelecener: -8241.85080012 hartree
twoeener: 3457.84388271 hartree
cpcmener: -0.03092377 hartree
kineticenergy: 2044.46849790 hartree
xcener: -151.863571588644 hartree
chargesum: 0.0000000
charge: -0.055516 -0.059942 -0.272948 -0.436428 -0.322660 -0.087239 0.085914 0.031358 -0.065916 -0.257907 -0.266663 -0.205743 0.369454 0.042163 0.398606 0.033858 -0.224779 -0.222498 -0.243997 0.311986 -0.115355 -0.234222 0.315114 -0.263042 -0.217354 -0.112907 -0.139819 -0.190473 0.078905 0.099793 0.096177 0.101456 0.091902 0.098750 0.091515 0.102266 0.130159 0.138816 0.146928 0.146431 0.158991 0.147657 0.144364 0.159206 0.157538 0.158221 0.157881
qa: -0.0555 -0.0599 -0.2729 -0.4364 -0.3227 -0.0872 0.0859 0.0314 -0.0659 -0.2579 -0.2667 -0.2057 0.3695 0.0422 0.3986 0.0339 -0.2248 -0.2225 -0.2440 0.3120 -0.1154 -0.2342 0.3151 -0.2630 -0.2174 -0.1129 -0.1398 -0.1905 0.0789 0.0998 0.0962 0.1015 0.0919 0.0987 0.0915 0.1023 0.1302 0.1388 0.1469 0.1464 0.1590 0.1477 0.1444 0.1592 0.1575 0.1582 0.1579
va: 1.2701 1.2448 2.1337 2.0748 2.0951 3.1117 3.7510 3.8740 3.8184 3.9078 3.9046 3.9011 4.2295 4.2133 3.7436 3.5716 4.0753 3.9529 3.9757 3.7149 3.8992 4.0135 3.6729 4.0138 3.9154 3.8762 3.8919 3.9146 1.0497 1.0315 1.0013 1.0014 1.0149 1.0014 1.0056 1.0008 1.0187 1.0170 1.0055 1.0116 0.9892 1.0059 1.0095 0.9971 0.9890 0.9908 0.9905
dispcorr: -0.024227033 hartree
energy: -2050.710416000526
dipole: -15.99251 16.52745 0.53495 22.51304 -22.42756 0.08548 -15.20739 13.74271 -1.46467
magnitude: 1.56165 au
magnitude: 3.96939 debye
