program: Orca
programVersion: 5.0.2
elementType: Cl Cl O O O N C C C C C C C C C C C C C C C C C C C C C C H H H H H H H H H H H H H H H H H H H
charge: 0
multiplicity: 1
keywords: wb97x-d3
keywords: def2-TZVPP
keywords: def2/J RIJCOSX
keywords: DEFGRID2
keywords: scfconv7
keywords: smallprint printgap noloewdin
keywords: NOSOSCF
formula: C22H19Cl2NO3
InChI: InChI=1/C22H19Cl2NO3/c1-22(2)17(12-19(23)24)20(22)21(26)28-18(13-25)14-7-6-10-16(11-14)27-15-8-4-3-5-9-15/h3-12,17-18,20H,1-2H3
47 atoms
Cl 2.285492 -4.944401 1.800608
Cl 3.288069 -6.122243 -0.633096
O  -1.766135 -1.017861 -1.282395
O  -1.205462 -1.42584 0.840533
O  -0.739545 3.836949 -0.605485
N  -4.461696 -0.178491 -2.977245
C  1.656157 -1.171261 -0.555437
C  1.381894 -2.563843 -0.059583
C  0.35768 -1.865852 -0.92609
C  1.662751 -0.054288 0.458556
C  2.632875 -0.949451 -1.684461
C  2.0764 -3.736594 -0.604741
C  -0.918637 -1.437087 -0.327567
C  2.484429 -4.785605 0.098275
C  -2.988385 -0.451615 -0.837277
C  -2.799742 0.897887 -0.179616
C  -3.801459 -0.308428 -2.04697
C  -1.839231 1.774691 -0.665321
C  -3.594459 1.251133 0.90032
C  -1.676816 3.011305 -0.059199
C  -3.434378 2.500282 1.482692
C  -2.481082 3.388321 1.010898
C  -0.003217 4.674881 0.189028
C  0.245113 5.949608 -0.299098
C  0.531573 4.26202 1.403618
C  1.035302 6.819891 0.438126
C  1.308817 5.14786 2.135689
C  1.562684 6.427804 1.660643
H  1.120067 -2.621445 0.990681
H  0.288318 -2.179756 -1.961959
H  1.351356 0.886957 0.000432
H  2.67585 0.086423 0.839432
H  1.018626 -0.241763 1.315301
H  2.562517 -1.704414 -2.466474
H  3.65797 -0.950355 -1.309146
H  2.453369 0.019787 -2.152779
H  2.266575 -3.763514 -1.671296
H  -3.517335 -1.130245 -0.159514
H  -1.209852 1.512485 -1.507587
H  -4.332355 0.558695 1.285354
H  -4.057211 2.787145 2.31957
H  -2.371082 4.359955 1.475344
H  -0.172739 6.253464 -1.250873
H  0.352433 3.262148 1.779684
H  1.229943 7.81313 0.054376
H  1.722419 4.828729 3.083722
H  2.170951 7.112196 2.237164
elementType: Cl O N C H
totalener: -2050.68631011 hartree
nucrepener: 2728.63122118 hartree
electener: -4779.31753129 hartree
oneelecener: -8232.42760665 hartree
twoeener: 3453.11007536 hartree
cpcmener: -0.03198226 hartree
kineticenergy: 2044.47173241 hartree
xcener: -151.864119111688 hartree
chargesum: 0.0000000
charge: -0.055004 -0.060053 -0.279726 -0.427496 -0.328380 -0.086003 0.095843 0.029011 -0.067152 -0.269400 -0.265311 -0.205102 0.356735 0.041393 0.406591 0.030337 -0.230020 -0.254438 -0.200667 0.254985 -0.126618 -0.177722 0.289501 -0.246709 -0.190636 -0.122279 -0.151539 -0.180656 0.078909 0.101037 0.092608 0.105419 0.097266 0.091611 0.102384 0.099266 0.130131 0.145336 0.137393 0.144203 0.160504 0.157860 0.145987 0.156153 0.157870 0.158967 0.157610
qa: -0.0550 -0.0601 -0.2797 -0.4275 -0.3284 -0.0860 0.0958 0.0290 -0.0672 -0.2694 -0.2653 -0.2051 0.3567 0.0414 0.4066 0.0303 -0.2300 -0.2544 -0.2007 0.2550 -0.1266 -0.1777 0.2895 -0.2467 -0.1906 -0.1223 -0.1515 -0.1807 0.0789 0.1010 0.0926 0.1054 0.0973 0.0916 0.1024 0.0993 0.1301 0.1453 0.1374 0.1442 0.1605 0.1579 0.1460 0.1562 0.1579 0.1590 0.1576
va: 1.2707 1.2447 2.1196 2.0824 2.0677 3.1124 3.7474 3.8868 3.8140 3.9043 3.9035 3.8989 4.2433 4.2131 3.7168 3.6114 4.0783 4.0097 3.9968 3.7807 3.9003 3.9168 3.6735 4.0153 3.8979 3.8871 3.9029 3.9035 1.0497 1.0312 1.0005 1.0020 1.0157 1.0055 1.0009 1.0019 1.0186 1.0148 1.0267 1.0029 0.9901 0.9943 1.0082 0.9971 0.9891 0.9906 0.9905
dispcorr: -0.024648115 hartree
energy: -2050.710958224993
dipole: -0.93140 2.06394 1.13253 40.09159 -38.83241 1.25918 0.96752 -0.08657 0.88095
magnitude: 1.90899 au
magnitude: 4.85227 debye
