program: Orca
programVersion: 5.0.2
elementType: Cl Cl O O O N C C C C C C C C C C C C C C C C C C C C C C H H H H H H H H H H H H H H H H H H H
charge: 0
multiplicity: 1
keywords: wb97x-d3
keywords: def2-TZVPP
keywords: def2/J RIJCOSX
keywords: DEFGRID2
keywords: scfconv7
keywords: smallprint printgap noloewdin
keywords: NOSOSCF
formula: C22H19Cl2NO3
InChI: InChI=1/C22H19Cl2NO3/c1-22(2)17(12-19(23)24)20(22)21(26)28-18(13-25)14-7-6-10-16(11-14)27-15-8-4-3-5-9-15/h3-12,17-18,20H,1-2H3
47 atoms
Cl 1.794831 -5.504997 1.610581
Cl 3.055526 -6.453949 -0.802789
O  -1.536115 -0.827224 -1.503079
O  -1.452063 -1.702118 0.550748
O  0.133216 3.504123 0.283237
N  -3.729445 0.782507 -3.370309
C  1.636455 -1.482802 -0.277396
C  1.191418 -2.904415 -0.061469
C  0.385087 -2.001809 -0.963181
C  1.533604 -0.536935 0.894137
C  2.810834 -1.183198 -1.176032
C  1.910737 -4.039052 -0.653285
C  -0.941886 -1.53421 -0.525112
C  2.210264 -5.169515 -0.026152
C  -2.720554 -0.132562 -1.141528
C  -2.441551 1.020031 -0.201764
C  -3.271647 0.368561 -2.402311
C  -1.307673 1.797026 -0.394362
C  -3.319497 1.298006 0.835052
C  -1.039398 2.839901 0.479005
C  -3.047883 2.358135 1.688275
C  -1.907524 3.128725 1.526235
C  0.240269 4.835903 0.585403
C  -0.715692 5.757982 0.177993
C  1.381083 5.244725 1.260044
C  -0.521836 7.10186 0.462276
C  1.567392 6.593993 1.526667
C  0.616758 7.526104 1.135287
H  0.748104 -3.088668 0.910572
H  0.48196 -2.151422 -2.033174
H  0.722779 -0.781149 1.577572
H  1.393084 0.491643 0.555557
H  2.461301 -0.567458 1.468632
H  2.772023 -0.144499 -1.508973
H  2.842009 -1.807855 -2.067987
H  3.750081 -1.321848 -0.637141
H  2.225132 -3.958072 -1.687229
H  -3.462243 -0.808764 -0.702829
H  -0.618581 1.59749 -1.206411
H  -4.201636 0.688266 0.983249
H  -3.722652 2.577222 2.505158
H  -1.69843 3.93477 2.217733
H  -1.599931 5.438275 -0.35972
H  2.118515 4.513449 1.56689
H  -1.265786 7.821734 0.146467
H  2.459663 6.913665 2.049627
H  0.762516 8.576705 1.349529
elementType: Cl O N C H
totalener: -2050.68591462 hartree
nucrepener: 2712.73766648 hartree
electener: -4763.42358110 hartree
oneelecener: -8200.81150852 hartree
twoeener: 3437.38792742 hartree
cpcmener: -0.03163099 hartree
kineticenergy: 2044.47532405 hartree
xcener: -151.864343786309 hartree
chargesum: 0.0000000
charge: -0.055173 -0.059992 -0.279968 -0.422464 -0.329245 -0.086082 0.097652 0.027020 -0.068062 -0.267809 -0.264329 -0.205574 0.347695 0.039837 0.410685 0.051908 -0.230903 -0.292470 -0.206339 0.283387 -0.122715 -0.186892 0.257967 -0.181219 -0.234782 -0.150982 -0.130593 -0.173001 0.080054 0.101827 0.097783 0.091094 0.106570 0.099398 0.091070 0.102118 0.131605 0.144926 0.140630 0.145182 0.160292 0.159083 0.158522 0.147160 0.158985 0.158103 0.158037
qa: -0.0552 -0.0600 -0.2800 -0.4225 -0.3292 -0.0861 0.0977 0.0270 -0.0681 -0.2678 -0.2643 -0.2056 0.3477 0.0398 0.4107 0.0519 -0.2309 -0.2925 -0.2063 0.2834 -0.1227 -0.1869 0.2580 -0.1812 -0.2348 -0.1510 -0.1306 -0.1730 0.0801 0.1018 0.0978 0.0911 0.1066 0.0994 0.0911 0.1021 0.1316 0.1449 0.1406 0.1452 0.1603 0.1591 0.1585 0.1472 0.1590 0.1581 0.1580
va: 1.2701 1.2448 2.1176 2.0873 2.0527 3.1123 3.7355 3.8881 3.8187 3.9012 3.9020 3.8956 4.2601 4.2106 3.7098 3.5770 4.0819 4.0348 4.0019 3.7174 3.9043 3.9339 3.7179 3.9124 4.0014 3.8967 3.8917 3.8953 1.0485 1.0308 1.0148 1.0044 1.0019 1.0021 1.0053 1.0012 1.0171 1.0143 1.0260 1.0027 0.9902 0.9948 0.9966 1.0062 0.9905 0.9896 0.9902
dispcorr: -0.024612941 hartree
energy: -2050.710527559153
dipole: -1.19446 1.97199 0.77753 42.20525 -40.90122 1.30403 3.37315 -2.47622 0.89693
magnitude: 1.76339 au
magnitude: 4.48217 debye
