program: Orca
programVersion: 5.0.2
elementType: Cl Cl O O O N C C C C C C C C C C C C C C C C C C C C C C H H H H H H H H H H H H H H H H H H H
charge: 0
multiplicity: 1
keywords: wb97x-d3
keywords: def2-TZVPP
keywords: def2/J RIJCOSX
keywords: DEFGRID2
keywords: scfconv7
keywords: smallprint printgap noloewdin
keywords: NOSOSCF
formula: C22H19Cl2NO3
InChI: InChI=1/C22H19Cl2NO3/c1-22(2)17(12-19(23)24)20(22)21(26)28-18(13-25)14-7-6-10-16(11-14)27-15-8-4-3-5-9-15/h3-12,17-18,20H,1-2H3
47 atoms
Cl 4.066963 -0.789254 0.654316
Cl 4.060619 -2.056778 3.246748
O  -2.348848 -1.712268 0.000398
O  -0.759821 -0.729058 -1.222316
O  -1.639112 3.832823 -0.19837
N  -3.519455 -0.665227 -3.062759
C  0.747479 -3.413901 -0.50937
C  1.307813 -2.24194 0.243858
C  -0.184181 -2.506606 0.272973
C  0.779652 -3.365675 -2.01675
C  0.926757 -4.807773 0.041442
C  2.074205 -2.407462 1.48544
C  -1.079234 -1.552179 -0.404028
C  3.240354 -1.831386 1.748961
C  -3.337114 -0.793502 -0.457671
C  -3.209855 0.556358 0.208144
C  -3.386619 -0.720496 -1.923041
C  -2.50853 1.60224 -0.375397
C  -3.779445 0.713641 1.46797
C  -2.337937 2.786088 0.329785
C  -3.633857 1.914858 2.143277
C  -2.902424 2.95263 1.585619
C  -0.474233 3.575093 -0.874957
C  0.454928 2.651757 -0.408508
C  -0.230488 4.30496 -2.028591
C  1.629617 2.455618 -1.119091
C  0.95565 4.10745 -2.721985
C  1.886529 3.179839 -2.276018
H  1.606112 -1.408219 -0.382423
H  -0.587265 -2.939615 1.181594
H  -0.07018 -3.905218 -2.44003
H  1.688761 -3.852054 -2.376181
H  0.773037 -2.354594 -2.418606
H  1.922376 -5.185362 -0.199176
H  0.199057 -5.486721 -0.406513
H  0.800543 -4.862583 1.122152
H  1.659448 -3.045158 2.25763
H  -4.280899 -1.251425 -0.150912
H  -2.088509 1.502432 -1.367577
H  -4.338026 -0.097751 1.917764
H  -4.082288 2.042546 3.119623
H  -2.770752 3.88531 2.11957
H  0.272927 2.087904 0.498007
H  -0.963413 5.020346 -2.380392
H  2.350037 1.732384 -0.757637
H  1.144649 4.67748 -3.622557
H  2.805764 3.022895 -2.824954
elementType: Cl O N C H
totalener: -2050.68405163 hartree
nucrepener: 2843.10697452 hartree
electener: -4893.79102615 hartree
oneelecener: -8462.41635316 hartree
twoeener: 3568.62532701 hartree
cpcmener: -0.03333376 hartree
kineticenergy: 2044.46375848 hartree
xcener: -151.864007300583 hartree
chargesum: 0.0000000
charge: -0.060411 -0.059393 -0.280597 -0.445197 -0.331607 -0.083506 0.087268 0.028574 -0.090019 -0.263735 -0.260908 -0.204982 0.424835 0.047136 0.455947 -0.028699 -0.246833 -0.138491 -0.227877 0.213911 -0.117137 -0.218961 0.292892 -0.204700 -0.249644 -0.118109 -0.112092 -0.202789 0.079020 0.096389 0.100888 0.098029 0.094406 0.102175 0.099578 0.089754 0.133103 0.144265 0.142428 0.144420 0.159257 0.148456 0.151586 0.144865 0.153961 0.156974 0.155570
qa: -0.0604 -0.0594 -0.2806 -0.4452 -0.3316 -0.0835 0.0873 0.0286 -0.0900 -0.2637 -0.2609 -0.2050 0.4248 0.0471 0.4559 -0.0287 -0.2468 -0.1385 -0.2279 0.2139 -0.1171 -0.2190 0.2929 -0.2047 -0.2496 -0.1181 -0.1121 -0.2028 0.0790 0.0964 0.1009 0.0980 0.0944 0.1022 0.0996 0.0898 0.1331 0.1443 0.1424 0.1444 0.1593 0.1485 0.1516 0.1449 0.1540 0.1570 0.1556
va: 1.2657 1.2458 2.1438 2.0455 2.0795 3.1059 3.7443 3.8752 3.8737 3.9060 3.9030 3.8805 4.1404 4.1971 3.8410 3.6300 4.0606 3.8915 3.9992 3.8290 3.8908 4.0188 3.6810 3.8799 4.0131 3.8639 3.8765 3.9333 1.0353 1.0332 0.9995 1.0002 1.0187 1.0009 1.0018 1.0052 1.0152 0.9932 1.0228 1.0025 0.9889 1.0039 1.0000 1.0080 0.9909 0.9888 0.9915
dispcorr: -0.025726081 hartree
energy: -2050.709777712991
dipole: -14.78628 14.25374 -0.53255 -5.48173 3.93084 -1.55089 -11.88643 13.95791 2.07148
magnitude: 2.64195 au
magnitude: 6.71531 debye
