program: Orca
programVersion: 5.0.2
elementType: Cl Cl O O O N C C C C C C C C C C C C C C C C C C C C C C H H H H H H H H H H H H H H H H H H H
charge: 0
multiplicity: 1
keywords: wb97x-d3
keywords: def2-TZVPP
keywords: def2/J RIJCOSX
keywords: DEFGRID2
keywords: scfconv7
keywords: smallprint printgap noloewdin
keywords: NOSOSCF
formula: C22H19Cl2NO3
InChI: InChI=1/C22H19Cl2NO3/c1-22(2)17(12-19(23)24)20(22)21(26)28-18(13-25)14-7-6-10-16(11-14)27-15-8-4-3-5-9-15/h3-12,17-18,20H,1-2H3
47 atoms
Cl 1.582584 -5.806584 1.357362
Cl 2.863283 -6.612051 -1.098958
O  -1.339232 -0.69536 -1.507271
O  -1.401166 -1.678554 0.496947
O  0.201994 3.648497 0.457789
N  -3.431899 0.988448 -3.42728
C  1.728024 -1.647519 -0.122287
C  1.169542 -3.043299 -0.091616
C  0.494759 -1.990201 -0.939043
C  1.608496 -0.817797 1.131853
C  2.982518 -1.356265 -0.908653
C  1.847522 -4.159189 -0.763016
C  -0.82786 -1.478194 -0.541288
C  2.062895 -5.356252 -0.233224
C  -2.53322 0.000787 -1.181771
C  -2.296203 1.117417 -0.189028
C  -3.018683 0.546124 -2.450962
C  -1.171555 1.922153 -0.318394
C  -3.209874 1.341814 0.829584
C  -0.956717 2.944212 0.593401
C  -2.988968 2.379295 1.724929
C  -1.863803 3.180933 1.620949
C  0.234386 4.99005 0.731621
C  -0.748701 5.857417 0.271667
C  1.330487 5.467685 1.434815
C  -0.628109 7.214683 0.532291
C  1.44342 6.829266 1.677661
C  0.46422 7.70708 1.234442
H  0.646036 -3.296464 0.823568
H  0.657818 -2.037434 -2.010261
H  1.521229 0.243528 0.889943
H  2.506874 -0.944168 1.738683
H  0.758531 -1.092581 1.75316
H  3.051058 -0.288614 -1.124282
H  3.023511 -1.883088 -1.861069
H  3.867444 -1.635464 -0.333641
H  2.201341 -4.002713 -1.77521
H  -3.302011 -0.682447 -0.805523
H  -0.453326 1.762476 -1.114004
H  -4.083184 0.710095 0.930647
H  -3.692796 2.556663 2.527251
H  -1.69513 3.972089 2.340363
H  -1.597512 5.486121 -0.289339
H  2.090293 4.779188 1.783104
H  -1.393234 7.891456 0.17442
H  2.300774 7.201081 2.223834
H  0.552741 8.767515 1.430501
elementType: Cl O N C H
totalener: -2050.68649721 hartree
nucrepener: 2696.48828064 hartree
electener: -4747.17477785 hartree
oneelecener: -8168.33032056 hartree
twoeener: 3421.15554271 hartree
cpcmener: -0.03158988 hartree
kineticenergy: 2044.47292056 hartree
xcener: -151.863525040252 hartree
chargesum: -0.0000000
charge: -0.054844 -0.059443 -0.281159 -0.427644 -0.330976 -0.087523 0.096398 0.029084 -0.072646 -0.267279 -0.262589 -0.204533 0.354950 0.038460 0.413310 0.041192 -0.229543 -0.274083 -0.199472 0.266459 -0.125727 -0.176972 0.256525 -0.176533 -0.236498 -0.152200 -0.129460 -0.174886 0.081911 0.100436 0.095473 0.103085 0.096596 0.099191 0.090809 0.102298 0.131724 0.144608 0.135869 0.145817 0.160454 0.159670 0.157989 0.146396 0.159177 0.157933 0.158194
qa: -0.0548 -0.0594 -0.2812 -0.4276 -0.3310 -0.0875 0.0964 0.0291 -0.0726 -0.2673 -0.2626 -0.2045 0.3550 0.0385 0.4133 0.0412 -0.2295 -0.2741 -0.1995 0.2665 -0.1257 -0.1770 0.2565 -0.1765 -0.2365 -0.1522 -0.1295 -0.1749 0.0819 0.1004 0.0955 0.1031 0.0966 0.0992 0.0908 0.1023 0.1317 0.1446 0.1359 0.1458 0.1605 0.1597 0.1580 0.1464 0.1592 0.1579 0.1582
va: 1.2704 1.2454 2.1202 2.0832 2.0520 3.1126 3.7354 3.8791 3.8313 3.9041 3.9032 3.8917 4.2470 4.2111 3.7071 3.5934 4.0819 4.0382 3.9943 3.7336 3.9031 3.9265 3.7187 3.9023 4.0038 3.8952 3.8931 3.8959 1.0479 1.0319 1.0016 1.0016 1.0158 1.0021 1.0051 1.0011 1.0167 1.0151 1.0287 1.0025 0.9904 0.9941 0.9969 1.0073 0.9905 0.9895 0.9903
dispcorr: -0.024073184 hartree
energy: -2050.710570391500
dipole: -0.12741 0.88282 0.75541 42.43228 -41.21738 1.21490 6.17588 -5.15395 1.02192
magnitude: 1.75811 au
magnitude: 4.46875 debye
