program: Orca
programVersion: 5.0.2
elementType: Cl Cl O O O N C C C C C C C C C C C C C C C C C C C C C C H H H H H H H H H H H H H H H H H H H
charge: 0
multiplicity: 1
keywords: wb97x-d3
keywords: def2-TZVPP
keywords: def2/J RIJCOSX
keywords: DEFGRID2
keywords: scfconv7
keywords: smallprint printgap noloewdin
keywords: NOSOSCF
formula: C22H19Cl2NO3
InChI: InChI=1/C22H19Cl2NO3/c1-22(2)17(12-19(23)24)20(22)21(26)28-18(13-25)14-7-6-10-16(11-14)27-15-8-4-3-5-9-15/h3-12,17-18,20H,1-2H3
47 atoms
Cl 0.913431 -6.184523 -1.256374
Cl 3.659778 -5.723675 -2.009892
O  -0.359925 -0.0195 -0.886058
O  -1.505693 -1.793568 -0.153653
O  -1.397352 4.138987 2.219705
N  -1.016548 2.307903 -3.136445
C  1.199386 -2.499351 1.246953
C  1.061426 -3.296603 -0.016071
C  0.887205 -1.787776 -0.055521
C  0.140193 -2.675838 2.307351
C  2.570076 -2.24031 1.825009
C  2.219205 -3.890924 -0.693912
C  -0.450801 -1.246713 -0.347223
C  2.250657 -5.100359 -1.239153
C  -1.584819 0.629455 -1.216351
C  -2.172874 1.355855 -0.031624
C  -1.249233 1.564286 -2.292717
C  -1.479236 2.421938 0.530684
C  -3.386695 0.94332 0.498529
C  -2.028186 3.094006 1.612773
C  -3.911891 1.611274 1.596103
C  -3.243741 2.689235 2.151767
C  -0.666012 5.024777 1.471237
C  0.556802 5.432739 1.982574
C  -1.146494 5.544972 0.275261
C  1.305818 6.373018 1.288453
C  -0.380636 6.473357 -0.413969
C  0.845368 6.891753 0.086553
H  0.135841 -3.855713 -0.093129
H  1.707903 -1.217296 -0.475045
H  -0.023169 -1.745103 2.853968
H  0.474419 -3.425172 3.027243
H  -0.816333 -3.009675 1.91296
H  2.921147 -3.112688 2.379342
H  2.530512 -1.400612 2.52091
H  3.318075 -2.000077 1.070456
H  3.12749 -3.303814 -0.759699
H  -2.310562 -0.083138 -1.620957
H  -0.524073 2.730481 0.120899
H  -3.920885 0.111224 0.058933
H  -4.857026 1.295886 2.017781
H  -3.659356 3.219665 2.99933
H  0.915849 5.020902 2.917483
H  -2.106345 5.235718 -0.119582
H  2.258695 6.693435 1.689579
H  -0.752043 6.875916 -1.347546
H  1.435731 7.618256 -0.456103
elementType: Cl O N C H
totalener: -2050.68703095 hartree
nucrepener: 2689.83514755 hartree
electener: -4740.52217850 hartree
oneelecener: -8155.18040903 hartree
twoeener: 3414.65823053 hartree
cpcmener: -0.03020898 hartree
kineticenergy: 2044.46824440 hartree
xcener: -151.862581149196 hartree
chargesum: -0.0000000
charge: -0.055020 -0.059346 -0.285081 -0.447043 -0.327853 -0.089143 0.090158 0.031332 -0.086663 -0.269012 -0.265563 -0.203923 0.401719 0.043187 0.425975 0.012562 -0.234112 -0.191579 -0.186418 0.232262 -0.120150 -0.224778 0.270752 -0.241193 -0.183481 -0.123102 -0.141769 -0.182453 0.081186 0.098716 0.101277 0.097531 0.095490 0.102017 0.099298 0.090982 0.129954 0.138184 0.145962 0.145231 0.158747 0.148967 0.146572 0.155226 0.157165 0.159117 0.158112
qa: -0.0550 -0.0593 -0.2851 -0.4470 -0.3279 -0.0891 0.0902 0.0313 -0.0867 -0.2690 -0.2656 -0.2039 0.4017 0.0432 0.4260 0.0126 -0.2341 -0.1916 -0.1864 0.2323 -0.1202 -0.2248 0.2708 -0.2412 -0.1835 -0.1231 -0.1418 -0.1825 0.0812 0.0987 0.1013 0.0975 0.0955 0.1020 0.0993 0.0910 0.1300 0.1382 0.1460 0.1452 0.1587 0.1490 0.1466 0.1552 0.1572 0.1591 0.1581
va: 1.2705 1.2456 2.1363 2.0666 2.0812 3.1087 3.7250 3.8668 3.8662 3.9054 3.9102 3.9028 4.1809 4.2138 3.7229 3.6033 4.0754 3.9563 3.9530 3.7802 3.9097 4.0077 3.7013 4.0091 3.9053 3.8840 3.8914 3.9034 1.0478 1.0322 0.9988 1.0003 1.0184 1.0007 1.0014 1.0056 1.0184 1.0170 1.0123 1.0089 0.9896 1.0046 1.0073 0.9972 0.9893 0.9902 0.9904
dispcorr: -0.023193919 hartree
energy: -2050.710224865104
dipole: -6.01625 6.30393 0.28767 31.03310 -30.77712 0.25598 21.74591 -20.15074 1.59517
magnitude: 1.64099 au
magnitude: 4.17107 debye
