program: Orca
programVersion: 5.0.2
elementType: Cl Cl O O O N C C C C C C C C C C C C C C C C C C C C C C H H H H H H H H H H H H H H H H H H H
charge: 0
multiplicity: 1
keywords: wb97x-d3
keywords: def2-TZVPP
keywords: def2/J RIJCOSX
keywords: DEFGRID2
keywords: scfconv7
keywords: smallprint printgap noloewdin
keywords: NOSOSCF
formula: C22H19Cl2NO3
InChI: InChI=1/C22H19Cl2NO3/c1-22(2)17(12-19(23)24)20(22)21(26)28-18(13-25)14-7-6-10-16(11-14)27-15-8-4-3-5-9-15/h3-12,17-18,20H,1-2H3
47 atoms
Cl 0.872143 -6.217701 -1.241606
Cl 3.623654 -5.79111 -1.996731
O  -0.323797 -0.017162 -0.888975
O  -1.495232 -1.785555 -0.183963
O  -1.354484 4.141273 2.231053
N  -0.934214 2.344439 -3.114843
C  1.195474 -2.522064 1.234457
C  1.048792 -3.319983 -0.027299
C  0.896947 -1.809384 -0.070723
C  0.130912 -2.679201 2.29227
C  2.568625 -2.283584 1.815446
C  2.200321 -3.93216 -0.699762
C  -0.4327 -1.249432 -0.365651
C  2.219541 -5.146094 -1.235153
C  -1.538818 0.649941 -1.220146
C  -2.127685 1.367905 -0.030924
C  -1.183305 1.594505 -2.28147
C  -1.436506 2.432038 0.537203
C  -3.340126 0.949774 0.498495
C  -1.986365 3.097171 1.622979
C  -3.865428 1.609783 1.600583
C  -3.199691 2.686883 2.161429
C  -0.662757 5.052301 1.475739
C  0.553391 5.496785 1.972223
C  -1.174345 5.561297 0.288077
C  1.263104 6.462848 1.272362
C  -0.44718 6.516038 -0.407121
C  0.771319 6.971241 0.078757
H  0.115539 -3.865922 -0.1058
H  1.726596 -1.251232 -0.489213
H  0.449654 -3.433938 3.013428
H  -0.83055 -2.995667 1.895482
H  -0.017062 -1.745397 2.837925
H  3.321761 -2.054141 1.062596
H  2.905306 -3.161554 2.369784
H  2.540327 -1.444037 2.511969
H  3.114734 -3.355269 -0.769551
H  -2.269266 -0.048849 -1.63985
H  -0.482809 2.746712 0.128732
H  -3.87323 0.119403 0.054495
H  -4.809489 1.289908 2.021079
H  -3.616138 3.212164 3.011763
H  0.93775 5.092775 2.900229
H  -2.128941 5.224002 -0.096001
H  2.210842 6.811163 1.661802
H  -0.843469 6.909802 -1.333982
H  1.331421 7.717792 -0.468697
elementType: Cl O N C H
totalener: -2050.68707339 hartree
nucrepener: 2688.48001828 hartree
electener: -4739.16709167 hartree
oneelecener: -8152.47003868 hartree
twoeener: 3413.30294701 hartree
cpcmener: -0.03019289 hartree
kineticenergy: 2044.47684516 hartree
xcener: -151.864249572601 hartree
chargesum: -0.0000000
charge: -0.055027 -0.059323 -0.284263 -0.447101 -0.328269 -0.089093 0.089257 0.032735 -0.087410 -0.268649 -0.265131 -0.204243 0.402203 0.042637 0.426277 0.012758 -0.234876 -0.187463 -0.184112 0.225847 -0.121563 -0.222193 0.270344 -0.242197 -0.180853 -0.122169 -0.142886 -0.183260 0.080941 0.098738 0.097628 0.095324 0.101218 0.090999 0.102113 0.099197 0.130124 0.138449 0.145766 0.145091 0.158844 0.149174 0.146154 0.154371 0.156954 0.159013 0.157927
qa: -0.0550 -0.0593 -0.2843 -0.4471 -0.3283 -0.0891 0.0893 0.0327 -0.0874 -0.2686 -0.2651 -0.2042 0.4022 0.0426 0.4263 0.0128 -0.2349 -0.1875 -0.1841 0.2258 -0.1216 -0.2222 0.2703 -0.2422 -0.1809 -0.1222 -0.1429 -0.1833 0.0809 0.0987 0.0976 0.0953 0.1012 0.0910 0.1021 0.0992 0.1301 0.1384 0.1458 0.1451 0.1588 0.1492 0.1462 0.1544 0.1570 0.1590 0.1579
va: 1.2704 1.2457 2.1367 2.0667 2.0797 3.1086 3.7269 3.8646 3.8667 3.9058 3.9097 3.9016 4.1810 4.2140 3.7228 3.5992 4.0750 3.9573 3.9514 3.7838 3.9103 4.0090 3.7021 4.0080 3.8997 3.8841 3.8927 3.9035 1.0480 1.0322 1.0003 1.0184 0.9988 1.0056 1.0006 1.0015 1.0183 1.0167 1.0117 1.0094 0.9896 1.0043 1.0076 0.9975 0.9893 0.9903 0.9905
dispcorr: -0.023217999 hartree
energy: -2050.710291384017
dipole: -6.02216 6.26860 0.24644 31.29513 -31.05594 0.23919 21.58015 -20.00194 1.57821
magnitude: 1.61514 au
magnitude: 4.10536 debye
