program: Orca
programVersion: 5.0.2
elementType: Cl Cl O O O N C C C C C C C C C C C C C C C C C C C C C C H H H H H H H H H H H H H H H H H H H
charge: 0
multiplicity: 1
keywords: wb97x-d3
keywords: def2-TZVPP
keywords: def2/J RIJCOSX
keywords: DEFGRID2
keywords: scfconv7
keywords: smallprint printgap noloewdin
keywords: NOSOSCF
formula: C22H19Cl2NO3
InChI: InChI=1/C22H19Cl2NO3/c1-22(2)17(12-19(23)24)20(22)21(26)28-18(13-25)14-7-6-10-16(11-14)27-15-8-4-3-5-9-15/h3-12,17-18,20H,1-2H3
47 atoms
Cl 4.288627 -4.186597 -0.98475
Cl 3.183584 -6.727045 -0.189606
O  -0.73419 -0.957828 0.850207
O  0.967445 -0.379806 -0.47896
O  -1.59276 4.839189 -0.548608
N  -2.082857 0.266798 3.602542
C  0.065305 -2.963018 -2.027988
C  1.283908 -3.266499 -1.208846
C  0.082766 -2.608657 -0.55206
C  0.177609 -1.884254 -3.077151
C  -0.879514 -4.070156 -2.427198
C  1.632922 -4.631961 -0.800355
C  0.189161 -1.215505 -0.094578
C  2.866197 -5.108173 -0.685283
C  -0.802939 0.375505 1.326458
C  -1.547778 1.297224 0.384717
C  -1.515636 0.292814 2.602367
C  -1.196928 2.639033 0.360767
C  -2.586558 0.819067 -0.404772
C  -1.91077 3.511891 -0.45033
C  -3.268098 1.700318 -1.230325
C  -2.943784 3.048118 -1.251384
C  -1.252422 5.553618 0.574664
C  -0.290677 6.541971 0.41862
C  -1.874147 5.353789 1.801179
C  0.053258 7.336074 1.5032
C  -1.509955 6.147708 2.879713
C  -0.54778 7.139049 2.73906
H  2.120727 -2.600868 -1.386799
H  -0.530398 -3.244387 0.075902
H  0.964272 -1.161953 -2.873763
H  -0.765142 -1.343398 -3.178568
H  0.39816 -2.343369 -4.042211
H  -0.490819 -4.60492 -3.295381
H  -1.847752 -3.650373 -2.703738
H  -1.054303 -4.796228 -1.634504
H  0.824166 -5.312902 -0.563564
H  0.193856 0.776888 1.537049
H  -0.373843 2.993599 0.970176
H  -2.868416 -0.225153 -0.385873
H  -4.073861 1.337425 -1.854012
H  -3.485619 3.736263 -1.887293
H  0.179031 6.691313 -0.545396
H  -2.635653 4.59412 1.924054
H  0.801525 8.107774 1.378433
H  -1.990698 5.990047 3.836342
H  -0.271772 7.754685 3.584563
elementType: Cl O N C H
totalener: -2050.67265584 hartree
nucrepener: 2665.13807499 hartree
electener: -4715.81073083 hartree
oneelecener: -8105.56197777 hartree
twoeener: 3389.75124693 hartree
cpcmener: -0.03745687 hartree
kineticenergy: 2044.44375342 hartree
xcener: -151.860072733937 hartree
chargesum: -0.0000000
charge: -0.056889 -0.060970 -0.286986 -0.462652 -0.338661 -0.100506 0.095861 0.025575 -0.068326 -0.267978 -0.269378 -0.199621 0.393960 0.041262 0.410503 0.029992 -0.221482 -0.199460 -0.210686 0.263542 -0.135212 -0.218406 0.293389 -0.257492 -0.194145 -0.121075 -0.147712 -0.192137 0.080913 0.099732 0.095368 0.099746 0.100345 0.102360 0.099189 0.093989 0.132295 0.146221 0.148643 0.149924 0.162474 0.151474 0.149156 0.157392 0.161335 0.163308 0.161820
qa: -0.0569 -0.0610 -0.2870 -0.4627 -0.3387 -0.1005 0.0959 0.0256 -0.0683 -0.2680 -0.2694 -0.1996 0.3940 0.0413 0.4105 0.0300 -0.2215 -0.1995 -0.2107 0.2635 -0.1352 -0.2184 0.2934 -0.2575 -0.1941 -0.1211 -0.1477 -0.1921 0.0809 0.0997 0.0954 0.0997 0.1003 0.1024 0.0992 0.0940 0.1323 0.1462 0.1486 0.1499 0.1625 0.1515 0.1492 0.1574 0.1613 0.1633 0.1618
va: 1.2688 1.2440 2.1183 2.0439 2.0672 3.1114 3.7314 3.8944 3.8331 3.9033 3.9101 3.9017 4.1738 4.2094 3.7110 3.6195 4.0771 3.9891 3.9417 3.7237 3.9134 4.0032 3.6758 4.0047 3.9009 3.8773 3.8874 3.9028 1.0469 1.0325 1.0172 0.9998 1.0010 1.0002 1.0009 1.0054 1.0183 1.0202 1.0041 1.0119 0.9886 1.0035 1.0074 0.9975 0.9879 0.9890 0.9893
dispcorr: -0.023232085 hartree
energy: -2050.695887924807
dipole: -24.39162 23.51105 -0.88058 26.68741 -26.91084 -0.22343 -8.74737 7.39616 -1.35121
magnitude: 1.62822 au
magnitude: 4.13860 debye
