program: Orca
programVersion: 5.0.2
elementType: Cl Cl O O O N C C C C C C C C C C C C C C C C C C C C C C H H H H H H H H H H H H H H H H H H H
charge: 0
multiplicity: 1
keywords: wb97x-d3
keywords: def2-TZVPP
keywords: def2/J RIJCOSX
keywords: DEFGRID2
keywords: scfconv7
keywords: smallprint printgap noloewdin
keywords: NOSOSCF
formula: C22H19Cl2NO3
InChI: InChI=1/C22H19Cl2NO3/c1-22(2)17(12-19(23)24)20(22)21(26)28-18(13-25)14-7-6-10-16(11-14)27-15-8-4-3-5-9-15/h3-12,17-18,20H,1-2H3
47 atoms
Cl 2.083406 0.104683 -1.991138
Cl 4.576301 -0.211731 -0.5795
O  -1.793118 -1.672972 -0.112611
O  -1.847314 -1.334009 2.092935
O  -0.853768 3.258192 -0.313238
N  -3.876576 -1.707839 -2.660463
C  0.604177 -3.481487 0.444106
C  1.028876 -2.152694 -0.099121
C  0.130999 -2.212397 1.130888
C  -0.331304 -4.323025 -0.390981
C  1.576283 -4.315889 1.243392
C  2.39988 -1.645048 0.033926
C  -1.25016 -1.704503 1.111625
C  2.935956 -0.706944 -0.73679
C  -3.088846 -1.115316 -0.240718
C  -3.096988 0.386917 -0.056325
C  -3.512991 -1.459988 -1.597991
C  -1.956906 1.125949 -0.330857
C  -4.25581 1.009993 0.388193
C  -1.968215 2.493096 -0.092123
C  -4.26615 2.384849 0.564467
C  -3.118509 3.13229 0.34318
C  0.352737 2.871232 0.21864
C  0.464674 2.055545 1.33888
C  1.486329 3.381379 -0.399679
C  1.728115 1.744081 1.823747
C  2.739305 3.065288 0.101131
C  2.868593 2.24452 1.213245
H  0.521554 -1.859978 -1.01035
H  0.611996 -2.012813 2.081609
H  -1.022247 -4.882758 0.241313
H  0.253609 -5.048213 -0.958994
H  -0.913079 -3.748762 -1.107627
H  2.25152 -4.856138 0.577866
H  1.03348 -5.053755 1.835799
H  2.180488 -3.728692 1.933659
H  3.033204 -2.066107 0.805224
H  -3.795645 -1.582296 0.453753
H  -1.055206 0.651943 -0.700695
H  -5.14052 0.424021 0.602599
H  -5.165981 2.877582 0.906981
H  -3.112959 4.201008 0.513974
H  -0.409356 1.66022 1.839817
H  1.384864 4.01653 -1.270681
H  1.812805 1.106094 2.693864
H  3.619654 3.460602 -0.388309
H  3.847507 1.994182 1.59765
elementType: Cl O N C H
totalener: -2050.66954000 hartree
nucrepener: 2987.92574464 hartree
electener: -5038.59528464 hartree
oneelecener: -8751.27658614 hartree
twoeener: 3712.68130150 hartree
cpcmener: -0.03764581 hartree
kineticenergy: 2044.46592360 hartree
xcener: -151.870121642957 hartree
chargesum: 0.0000000
charge: -0.061398 -0.066761 -0.275539 -0.461008 -0.337768 -0.098613 0.101440 0.038448 -0.068328 -0.263748 -0.290233 -0.238444 0.401032 0.080980 0.379406 0.035523 -0.224047 -0.180394 -0.221611 0.255118 -0.112624 -0.227109 0.325883 -0.198481 -0.262917 -0.180742 -0.121415 -0.172546 0.093042 0.105105 0.103383 0.097530 0.092942 0.105112 0.100848 0.095136 0.132512 0.152385 0.134870 0.149709 0.163124 0.150545 0.153037 0.144819 0.162002 0.154198 0.155599
qa: -0.0614 -0.0668 -0.2755 -0.4610 -0.3378 -0.0986 0.1014 0.0384 -0.0683 -0.2637 -0.2902 -0.2384 0.4010 0.0810 0.3794 0.0355 -0.2240 -0.1804 -0.2216 0.2551 -0.1126 -0.2271 0.3259 -0.1985 -0.2629 -0.1807 -0.1214 -0.1725 0.0930 0.1051 0.1034 0.0975 0.0929 0.1051 0.1008 0.0951 0.1325 0.1524 0.1349 0.1497 0.1631 0.1505 0.1530 0.1448 0.1620 0.1542 0.1556
va: 1.2625 1.2350 2.1140 2.0354 2.0757 3.1080 3.7939 3.7989 3.8275 3.9056 3.9214 3.9236 4.1398 4.1755 3.7290 3.5885 4.0757 3.9604 3.9896 3.7244 3.8752 4.0120 3.6392 3.8400 3.9722 3.8573 3.8600 3.8047 1.0358 1.0239 0.9999 1.0001 1.0100 0.9990 1.0002 1.0044 1.0222 1.0130 1.0130 1.0008 0.9872 1.0031 1.0054 1.0082 0.9915 0.9917 0.9981
dispcorr: -0.031133225 hartree
energy: -2050.700673222133
dipole: -9.35639 9.98899 0.63259 -13.23751 12.13605 -1.10145 14.13558 -12.55949 1.57609
magnitude: 2.02421 au
magnitude: 5.14514 debye
