program: Orca
programVersion: 5.0.2
elementType: Cl Cl O O O N C C C C C C C C C C C C C C C C C C C C C C H H H H H H H H H H H H H H H H H H H
charge: 0
multiplicity: 1
keywords: wb97x-d3
keywords: def2-TZVPP
keywords: def2/J RIJCOSX
keywords: DEFGRID2
keywords: scfconv7
keywords: smallprint printgap noloewdin
keywords: NOSOSCF
formula: C22H19Cl2NO3
InChI: InChI=1/C22H19Cl2NO3/c1-22(2)17(12-19(23)24)20(22)21(26)28-18(13-25)14-7-6-10-16(11-14)27-15-8-4-3-5-9-15/h3-12,17-18,20H,1-2H3
47 atoms
Cl 3.883638 -3.420942 1.318381
Cl 3.365398 -5.8299 -0.180412
O  -1.919569 -1.095154 -0.069919
O  -0.14788 -0.126982 0.897548
O  -1.820069 4.513655 0.056024
N  -5.010215 -1.592043 0.980656
C  1.340219 -1.268855 -1.607114
C  1.590057 -2.168823 -0.433579
C  0.166103 -1.790742 -0.797848
C  1.779909 0.170507 -1.492972
C  1.464048 -1.813347 -3.009486
C  1.998042 -3.568607 -0.60526
C  -0.598096 -0.915345 0.103949
C  2.951064 -4.17981 0.086351
C  -2.795398 -0.2430 0.669181
C  -3.011963 1.054894 -0.067142
C  -4.035511 -1.002118 0.825648
C  -2.3616 2.191905 0.388021
C  -3.779137 1.096347 -1.226977
C  -2.451538 3.367438 -0.345599
C  -3.892613 2.287793 -1.924441
C  -3.220471 3.424714 -1.497595
C  -0.54106 4.435937 0.555355
C  -0.213151 5.309092 1.58209
C  0.407541 3.563945 0.03268
C  1.078474 5.309947 2.089919
C  1.691382 3.56926 0.558548
C  2.034131 4.437998 1.586583
H  1.984045 -1.665909 0.442242
H  -0.422326 -2.556426 -1.290061
H  1.098916 0.831191 -2.032688
H  2.767987 0.279243 -1.942894
H  1.853898 0.518415 -0.465813
H  0.93826 -1.163473 -3.710351
H  1.050461 -2.814638 -3.119377
H  2.512017 -1.847182 -3.311907
H  1.484503 -4.157535 -1.355829
H  -2.407606 -0.054722 1.674676
H  -1.78083 2.153894 1.300867
H  -4.288545 0.210735 -1.586735
H  -4.494938 2.331668 -2.821694
H  -3.292897 4.349501 -2.055297
H  -0.962069 5.983494 1.977855
H  0.161053 2.887244 -0.776184
H  1.33233 5.992422 2.890374
H  2.428888 2.889002 0.15197
H  3.037491 4.436232 1.99074
elementType: Cl O N C H
totalener: -2050.67284593 hartree
nucrepener: 2769.15087476 hartree
electener: -4819.82372069 hartree
oneelecener: -8313.39782405 hartree
twoeener: 3493.57410337 hartree
cpcmener: -0.03612501 hartree
kineticenergy: 2044.45033257 hartree
xcener: -151.860908098271 hartree
chargesum: -0.0000000
charge: -0.057268 -0.060632 -0.278725 -0.471024 -0.340129 -0.101238 0.111490 0.038960 -0.101189 -0.290435 -0.264317 -0.206596 0.429098 0.038599 0.411422 0.001804 -0.218592 -0.176749 -0.211674 0.269245 -0.129062 -0.223647 0.290624 -0.249938 -0.203943 -0.126730 -0.148705 -0.191428 0.083509 0.100611 0.108132 0.103368 0.084714 0.099675 0.093536 0.101430 0.134970 0.137896 0.147113 0.145102 0.163261 0.150777 0.148313 0.169508 0.160954 0.166700 0.161212
qa: -0.0573 -0.0606 -0.2787 -0.4710 -0.3401 -0.1012 0.1115 0.0390 -0.1012 -0.2904 -0.2643 -0.2066 0.4291 0.0386 0.4114 0.0018 -0.2186 -0.1767 -0.2117 0.2692 -0.1291 -0.2236 0.2906 -0.2499 -0.2039 -0.1267 -0.1487 -0.1914 0.0835 0.1006 0.1081 0.1034 0.0847 0.0997 0.0935 0.1014 0.1350 0.1379 0.1471 0.1451 0.1633 0.1508 0.1483 0.1695 0.1610 0.1667 0.1612
va: 1.2683 1.2449 2.1358 2.0338 2.0720 3.1088 3.7025 3.8661 3.8825 3.9141 3.9077 3.8931 4.1443 4.2091 3.7291 3.6312 4.0698 3.9143 3.9896 3.7292 3.9051 4.0251 3.7038 4.0001 3.8883 3.8847 3.8800 3.9240 1.0428 1.0332 0.9950 1.0025 1.0139 1.0011 1.0053 1.0010 1.0160 1.0182 1.0148 1.0076 0.9883 1.0037 1.0073 0.9851 0.9875 0.9873 0.9898
dispcorr: -0.025469246 hartree
energy: -2050.698315179056
dipole: -7.09968 8.08537 0.98569 29.88656 -29.07497 0.81160 -14.66859 12.94590 -1.72269
magnitude: 2.14428 au
magnitude: 5.45033 debye
