program: Orca
programVersion: 5.0.2
elementType: Cl Cl O O O N C C C C C C C C C C C C C C C C C C C C C C H H H H H H H H H H H H H H H H H H H
charge: 0
multiplicity: 1
keywords: wb97x-d3
keywords: def2-TZVPP
keywords: def2/J RIJCOSX
keywords: DEFGRID2
keywords: scfconv7
keywords: smallprint printgap noloewdin
keywords: NOSOSCF
formula: C22H19Cl2NO3
InChI: InChI=1/C22H19Cl2NO3/c1-22(2)17(12-19(23)24)20(22)21(26)28-18(13-25)14-7-6-10-16(11-14)27-15-8-4-3-5-9-15/h3-12,17-18,20H,1-2H3
47 atoms
Cl 1.643752 -5.464784 0.591294
Cl 3.661076 -5.331826 -1.465919
O  -1.183439 -0.20099 -1.376376
O  -1.415853 -1.359555 0.519594
O  -1.729102 4.369399 0.961604
N  -3.185691 1.013447 -3.710521
C  1.708858 -0.987643 0.64409
C  1.381695 -2.363131 0.146617
C  0.741215 -1.153661 -0.512615
C  1.217081 -0.610295 2.019396
C  3.033352 -0.351925 0.296562
C  2.334125 -3.161335 -0.632718
C  -0.70677 -0.947052 -0.363503
C  2.515417 -4.470101 -0.510943
C  -2.570523 0.104331 -1.338933
C  -2.918972 1.146231 -0.300746
C  -2.889719 0.606739 -2.676192
C  -2.115957 2.269976 -0.154971
C  -4.057112 0.980747 0.475072
C  -2.45839 3.222993 0.793788
C  -4.397424 1.955059 1.402003
C  -3.597865 3.073953 1.57312
C  -0.355955 4.310451 0.939125
C  0.313627 5.342678 0.298794
C  0.344036 3.295602 1.579197
C  1.701765 5.357877 0.301757
C  1.731203 3.318636 1.564817
C  2.41566 4.345221 0.927343
H  0.717866 -2.924287 0.794286
H  1.138513 -0.867879 -1.479455
H  0.350255 -1.182299 2.340784
H  0.961854 0.448997 2.065614
H  2.01222 -0.788052 2.744995
H  2.969101 0.730965 0.415381
H  3.348751 -0.547962 -0.727148
H  3.815731 -0.7137 0.96565
H  2.94156 -2.651631 -1.37094
H  -3.169621 -0.798035 -1.179565
H  -1.237737 2.4044 -0.775241
H  -4.673163 0.098959 0.355299
H  -5.283409 1.834568 2.010625
H  -3.853905 3.829049 2.305147
H  -0.246149 6.12823 -0.192691
H  -0.179677 2.496711 2.089487
H  2.224497 6.164021 -0.195962
H  2.277514 2.528303 2.063352
H  3.497284 4.356906 0.922247
elementType: Cl O N C H
totalener: -2050.67292391 hartree
nucrepener: 2783.76809587 hartree
electener: -4834.44101977 hartree
oneelecener: -8342.38199522 hartree
twoeener: 3507.94097545 hartree
cpcmener: -0.03824425 hartree
kineticenergy: 2044.45513188 hartree
xcener: -151.862685050054 hartree
chargesum: 0.0000000
charge: -0.057356 -0.060918 -0.288617 -0.462828 -0.341124 -0.101088 0.104196 0.023457 -0.063641 -0.268908 -0.270542 -0.204467 0.394040 0.041402 0.432542 0.011112 -0.225009 -0.178497 -0.206408 0.229695 -0.119002 -0.226086 0.279277 -0.252917 -0.177530 -0.119820 -0.163771 -0.192786 0.080865 0.100353 0.099561 0.082838 0.105010 0.096227 0.094278 0.102843 0.134503 0.146794 0.150060 0.149771 0.162760 0.151695 0.148790 0.164491 0.161079 0.172830 0.160845
qa: -0.0574 -0.0609 -0.2886 -0.4628 -0.3411 -0.1011 0.1042 0.0235 -0.0636 -0.2689 -0.2705 -0.2045 0.3940 0.0414 0.4325 0.0111 -0.2250 -0.1785 -0.2064 0.2297 -0.1190 -0.2261 0.2793 -0.2529 -0.1775 -0.1198 -0.1638 -0.1928 0.0809 0.1004 0.0996 0.0828 0.1050 0.0962 0.0943 0.1028 0.1345 0.1468 0.1501 0.1498 0.1628 0.1517 0.1488 0.1645 0.1611 0.1728 0.1608
va: 1.2681 1.2442 2.1255 2.0456 2.0646 3.1105 3.6969 3.8901 3.8438 3.9005 3.9154 3.9046 4.1722 4.2081 3.6939 3.6087 4.0918 3.9244 3.9763 3.7610 3.8948 4.0085 3.7034 4.0089 3.8759 3.8827 3.8708 3.9217 1.0479 1.0329 1.0207 1.0058 1.0007 1.0039 1.0069 1.0002 1.0173 1.0164 1.0158 1.0014 0.9879 1.0033 1.0069 0.9919 0.9873 0.9793 0.9909
dispcorr: -0.025968796 hartree
energy: -2050.698892701956
dipole: -0.14225 1.38429 1.24203 33.78706 -33.26172 0.52534 13.14072 -11.83575 1.30497
magnitude: 1.87659 au
magnitude: 4.76990 debye
