program: Orca
programVersion: 5.0.2
elementType: Cl Cl O O O N C C C C C C C C C C C C C C C C C C C C C C H H H H H H H H H H H H H H H H H H H
charge: 0
multiplicity: 1
keywords: wb97x-d3
keywords: def2-TZVPP
keywords: def2/J RIJCOSX
keywords: DEFGRID2
keywords: scfconv7
keywords: smallprint printgap noloewdin
keywords: NOSOSCF
formula: C22H19Cl2NO3
InChI: InChI=1/C22H19Cl2NO3/c1-22(2)17(12-19(23)24)20(22)21(26)28-18(13-25)14-7-6-10-16(11-14)27-15-8-4-3-5-9-15/h3-12,17-18,20H,1-2H3
47 atoms
Cl 2.125103 0.040355 -1.675964
Cl 4.242061 -0.076912 0.279119
O  -2.080191 -2.024442 -0.13712
O  -2.202121 -1.896927 2.086867
O  -0.549422 2.738574 -0.946268
N  -4.099029 -1.531825 -2.700031
C  0.465975 -3.687191 0.233406
C  0.800553 -2.239132 0.032559
C  -0.180686 -2.650953 1.12623
C  -0.305039 -4.396789 -0.852159
C  1.455026 -4.595448 0.925914
C  2.086511 -1.653466 0.424766
C  -1.573015 -2.17635 1.095487
C  2.7190 -0.691006 -0.235967
C  -3.265977 -1.245144 -0.239971
C  -2.979188 0.212053 0.038187
C  -3.725649 -1.423424 -1.617474
C  -1.89452 0.818994 -0.587103
C  -3.761048 0.922826 0.934676
C  -1.605954 2.140026 -0.301748
C  -3.46354 2.253246 1.20105
C  -2.383258 2.868139 0.589425
C  0.611251 2.952084 -0.249062
C  0.886575 2.35742 0.975935
C  1.538077 3.795826 -0.850319
C  2.101077 2.621006 1.596652
C  2.745575 4.045082 -0.217751
C  3.033756 3.463509 1.010645
H  0.339683 -1.794831 -0.841296
H  0.21007 -2.630551 2.137138
H  0.397547 -4.904657 -1.51489
H  -0.905862 -3.732187 -1.467155
H  -0.961491 -5.157072 -0.425633
H  2.21913 -4.931881 0.223331
H  0.943422 -5.48007 1.307959
H  1.958156 -4.122748 1.768359
H  2.563663 -2.02386 1.324096
H  -4.054628 -1.618411 0.420528
H  -1.271234 0.274683 -1.287422
H  -4.596607 0.442002 1.426729
H  -4.072618 2.811489 1.898918
H  -2.145211 3.902967 0.80077
H  0.179291 1.69054 1.451388
H  1.313095 4.248688 -1.807936
H  2.313662 2.15639 2.550655
H  3.463971 4.702694 -0.689779
H  3.976106 3.663323 1.502618
elementType: Cl O N C H
totalener: -2050.66966651 hartree
nucrepener: 2968.29194180 hartree
electener: -5018.96160831 hartree
oneelecener: -8712.19402772 hartree
twoeener: 3693.23241941 hartree
cpcmener: -0.03850968 hartree
kineticenergy: 2044.45548000 hartree
xcener: -151.864454480227 hartree
chargesum: -0.0000000
charge: -0.062621 -0.065012 -0.281671 -0.458407 -0.335309 -0.098473 0.093060 0.031264 -0.053967 -0.260286 -0.274995 -0.213747 0.387077 0.071689 0.403644 -0.025286 -0.226837 -0.173036 -0.164427 0.184688 -0.136341 -0.141429 0.273802 -0.159272 -0.240442 -0.195620 -0.123240 -0.191969 0.088068 0.098054 0.096490 0.092313 0.101829 0.101970 0.100152 0.093890 0.131363 0.145028 0.141095 0.151061 0.163846 0.159538 0.149124 0.145714 0.158937 0.160158 0.158531
qa: -0.0626 -0.0650 -0.2817 -0.4584 -0.3353 -0.0985 0.0931 0.0313 -0.0540 -0.2603 -0.2750 -0.2137 0.3871 0.0717 0.4036 -0.0253 -0.2268 -0.1730 -0.1644 0.1847 -0.1363 -0.1414 0.2738 -0.1593 -0.2404 -0.1956 -0.1232 -0.1920 0.0881 0.0981 0.0965 0.0923 0.1018 0.1020 0.1002 0.0939 0.1314 0.1450 0.1411 0.1511 0.1638 0.1595 0.1491 0.1457 0.1589 0.1602 0.1585
va: 1.2624 1.2352 2.1220 2.0432 2.0486 3.1049 3.7596 3.8487 3.8361 3.9010 3.9194 3.9251 4.1783 4.1724 3.7508 3.6419 4.0791 4.0064 3.9433 3.8105 3.8863 3.9555 3.6375 3.7713 3.9721 3.8825 3.8935 3.8621 1.0263 1.0280 0.9998 1.0115 1.0004 1.0002 1.0008 1.0052 1.0206 1.0137 1.0188 1.0003 0.9882 0.9946 1.0058 1.0085 0.9928 0.9870 0.9896
dispcorr: -0.030059781 hartree
energy: -2050.699726293155
dipole: -7.34148 8.00356 0.66208 -11.34452 10.57347 -0.77105 10.18284 -8.38768 1.79516
magnitude: 2.06287 au
magnitude: 5.24341 debye
