program: Orca
programVersion: 5.0.2
elementType: Cl Cl O O O N C C C C C C C C C C C C C C C C C C C C C C H H H H H H H H H H H H H H H H H H H
charge: 0
multiplicity: 1
keywords: wb97x-d3
keywords: def2-TZVPP
keywords: def2/J RIJCOSX
keywords: DEFGRID2
keywords: scfconv7
keywords: smallprint printgap noloewdin
keywords: NOSOSCF
formula: C22H19Cl2NO3
InChI: InChI=1/C22H19Cl2NO3/c1-22(2)17(12-19(23)24)20(22)21(26)28-18(13-25)14-7-6-10-16(11-14)27-15-8-4-3-5-9-15/h3-12,17-18,20H,1-2H3
47 atoms
Cl 2.193297 0.107858 -1.473389
Cl 4.221522 -0.108051 0.565463
O  -2.084847 -2.046587 -0.156528
O  -2.212938 -1.991185 2.07023
O  -0.556504 2.716775 -1.021004
N  -4.151655 -1.528025 -2.681434
C  0.450237 -3.712977 0.126077
C  0.803896 -2.258424 0.048199
C  -0.201854 -2.745181 1.088621
C  -0.308943 -4.318851 -1.029953
C  1.415837 -4.686958 0.759754
C  2.079718 -1.708873 0.517439
C  -1.585219 -2.246442 1.071399
C  2.73173 -0.704486 -0.056789
C  -3.263294 -1.253749 -0.240018
C  -2.951165 0.195703 0.047983
C  -3.744352 -1.419505 -1.61142
C  -1.893863 0.805373 -0.620625
C  -3.670926 0.891357 1.006078
C  -1.57309 2.115633 -0.32037
C  -3.338331 2.209683 1.291432
C  -2.286897 2.827554 0.635397
C  0.60657 3.031237 -0.366211
C  0.984502 2.444743 0.835046
C  1.43176 3.954835 -0.995291
C  2.20479 2.790687 1.399523
C  2.647816 4.287156 -0.418483
C  3.040913 3.71022 0.782399
H  0.364338 -1.741799 -0.796383
H  0.173932 -2.807336 2.103442
H  0.394856 -4.825788 -1.691688
H  -0.844981 -3.588452 -1.630103
H  -1.023767 -5.06473 -0.678906
H  1.909326 -4.287886 1.644883
H  2.187436 -4.976493 0.044755
H  0.887133 -5.592433 1.061424
H  2.525362 -2.137358 1.40702
H  -4.047064 -1.621508 0.429265
H  -1.318616 0.271731 -1.368641
H  -4.485016 0.408462 1.530804
H  -3.898548 2.756618 2.037392
H  -2.024238 3.853793 0.85936
H  0.356009 1.712803 1.325545
H  1.124696 4.402801 -1.932103
H  2.502189 2.327549 2.330946
H  3.288484 5.006262 -0.912208
H  3.989866 3.972835 1.23033
elementType: Cl O N C H
totalener: -2050.66925123 hartree
nucrepener: 2961.98112733 hartree
electener: -5012.65037856 hartree
oneelecener: -8699.48419206 hartree
twoeener: 3686.83381350 hartree
cpcmener: -0.03831847 hartree
kineticenergy: 2044.46998661 hartree
xcener: -151.867147685231 hartree
chargesum: -0.0000000
charge: -0.060947 -0.063610 -0.279963 -0.460231 -0.335337 -0.098168 0.093604 0.028182 -0.051162 -0.259099 -0.275471 -0.216019 0.387270 0.074690 0.406251 -0.012753 -0.228445 -0.198846 -0.169507 0.201358 -0.132513 -0.148768 0.266561 -0.151184 -0.235434 -0.207267 -0.135810 -0.176188 0.086929 0.097188 0.096108 0.090996 0.102437 0.093870 0.101392 0.100545 0.131721 0.143711 0.142804 0.151179 0.164104 0.160724 0.148537 0.147068 0.158409 0.160807 0.160279
qa: -0.0609 -0.0636 -0.2800 -0.4602 -0.3353 -0.0982 0.0936 0.0282 -0.0512 -0.2591 -0.2755 -0.2160 0.3873 0.0747 0.4063 -0.0128 -0.2284 -0.1988 -0.1695 0.2014 -0.1325 -0.1488 0.2666 -0.1512 -0.2354 -0.2073 -0.1358 -0.1762 0.0869 0.0972 0.0961 0.0910 0.1024 0.0939 0.1014 0.1005 0.1317 0.1437 0.1428 0.1512 0.1641 0.1607 0.1485 0.1471 0.1584 0.1608 0.1603
va: 1.2653 1.2389 2.1240 2.0427 2.0464 3.1059 3.7506 3.8588 3.8360 3.9008 3.9210 3.9262 4.1799 4.1722 3.7529 3.6324 4.0783 4.0239 3.9477 3.8039 3.8845 3.9517 3.6430 3.7684 3.9773 3.8842 3.9077 3.8669 1.0243 1.0286 0.9999 1.0115 1.0004 1.0050 1.0003 1.0004 1.0208 1.0139 1.0206 1.0011 0.9883 0.9940 1.0056 1.0079 0.9958 0.9874 0.9886
dispcorr: -0.029846706 hartree
energy: -2050.699097934005
dipole: -7.37550 8.12950 0.75401 -11.07433 10.34935 -0.72497 7.81507 -6.11021 1.70486
magnitude: 2.00016 au
magnitude: 5.08401 debye
