program: Orca
programVersion: 5.0.2
elementType: Cl Cl O O O N C C C C C C C C C C C C C C C C C C C C C C H H H H H H H H H H H H H H H H H H H
charge: 0
multiplicity: 1
keywords: wb97x-d3
keywords: def2-TZVPP
keywords: def2/J RIJCOSX
keywords: DEFGRID2
keywords: scfconv7
keywords: smallprint printgap noloewdin
keywords: NOSOSCF
formula: C22H19Cl2NO3
InChI: InChI=1/C22H19Cl2NO3/c1-22(2)17(12-19(23)24)20(22)21(26)28-18(13-25)14-7-6-10-16(11-14)27-15-8-4-3-5-9-15/h3-12,17-18,20H,1-2H3
47 atoms
Cl 1.525381 -5.646437 0.39023
Cl 3.804108 -5.310673 -1.344358
O  -1.074308 -0.126716 -1.416919
O  -1.572997 -1.593806 0.193793
O  -1.707425 4.168635 1.427668
N  -2.740096 1.597516 -3.690511
C  1.490176 -1.182482 0.835488
C  1.261337 -2.51402 0.181292
C  0.70846 -1.258191 -0.463623
C  0.784559 -0.912678 2.141427
C  2.84359 -0.521422 0.750073
C  2.333196 -3.235059 -0.514526
C  -0.747251 -1.049239 -0.495293
C  2.520187 -4.54833 -0.486012
C  -2.44357 0.261571 -1.464972
C  -2.82421 1.127502 -0.288527
C  -2.588413 1.00455 -2.716933
C  -2.062422 2.256604 -0.008876
C  -3.90504 0.781186 0.505976
C  -2.384202 3.030015 1.095915
C  -4.227798 1.579243 1.595399
C  -3.467558 2.694785 1.901455
C  -0.393567 4.330613 1.0507
C  -0.047173 5.527621 0.443908
C  0.566485 3.364483 1.324594
C  1.280783 5.763627 0.11383
C  1.887152 3.608918 0.978208
C  2.250407 4.806026 0.374223
H  0.520835 -3.133223 0.674488
H  1.237747 -0.887362 -1.333836
H  0.526178 0.144114 2.231331
H  1.452164 -1.158839 2.968497
H  -0.122594 -1.497783 2.271992
H  3.309624 -0.621734 -0.229275
H  3.521534 -0.946038 1.492409
H  2.750824 0.546051 0.958013
H  3.029555 -2.657061 -1.110313
H  -3.102495 -0.610276 -1.525239
H  -1.231146 2.524873 -0.650225
H  -4.487896 -0.102204 0.279443
H  -5.068675 1.319895 2.224247
H  -3.710689 3.309044 2.758947
H  -0.807151 6.270731 0.239237
H  0.294093 2.432232 1.804446
H  1.553277 6.699973 -0.354936
H  2.637165 2.857597 1.188307
H  3.283306 4.990887 0.111224
elementType: Cl O N C H
totalener: -2050.67323339 hartree
nucrepener: 2779.54864948 hartree
electener: -4830.22188287 hartree
oneelecener: -8333.98472217 hartree
twoeener: 3503.76283930 hartree
cpcmener: -0.03861119 hartree
kineticenergy: 2044.45874731 hartree
xcener: -151.863064572501 hartree
chargesum: -0.0000000
charge: -0.057200 -0.061090 -0.283533 -0.461701 -0.335327 -0.100338 0.084712 0.027380 -0.058326 -0.261786 -0.264205 -0.205520 0.388082 0.039839 0.426687 0.016344 -0.226328 -0.215514 -0.214339 0.273932 -0.106574 -0.246967 0.259648 -0.223744 -0.204013 -0.136901 -0.176014 -0.171105 0.080348 0.101570 0.093392 0.102818 0.097804 0.094801 0.103545 0.087821 0.133596 0.144365 0.146702 0.150295 0.162328 0.150399 0.148619 0.192960 0.161299 0.180405 0.160835
qa: -0.0572 -0.0611 -0.2835 -0.4617 -0.3353 -0.1003 0.0847 0.0274 -0.0583 -0.2618 -0.2642 -0.2055 0.3881 0.0398 0.4267 0.0163 -0.2263 -0.2155 -0.2143 0.2739 -0.1066 -0.2470 0.2596 -0.2237 -0.2040 -0.1369 -0.1760 -0.1711 0.0803 0.1016 0.0934 0.1028 0.0978 0.0948 0.1035 0.0878 0.1336 0.1444 0.1467 0.1503 0.1623 0.1504 0.1486 0.1930 0.1613 0.1804 0.1608
va: 1.2683 1.2439 2.1331 2.0475 2.0768 3.1108 3.7311 3.8924 3.8404 3.8948 3.9128 3.9027 4.1926 4.2089 3.7195 3.6023 4.0903 3.9371 3.9651 3.7416 3.8923 4.0069 3.7310 3.9935 3.9236 3.8856 3.9012 3.9075 1.0479 1.0316 1.0027 1.0012 1.0176 1.0058 1.0016 1.0077 1.0172 1.0150 1.0162 1.0032 0.9877 1.0050 1.0063 0.9654 0.9881 0.9791 0.9904
dispcorr: -0.025702978 hartree
energy: -2050.698936369006
dipole: -2.00951 3.15445 1.14494 33.32101 -32.81947 0.50154 13.87909 -12.55876 1.32033
magnitude: 1.81816 au
magnitude: 4.62140 debye
