program: Orca
programVersion: 5.0.2
elementType: Cl Cl O O O N C C C C C C C C C C C C C C C C C C C C C C H H H H H H H H H H H H H H H H H H H
charge: 0
multiplicity: 1
keywords: wb97x-d3
keywords: def2-TZVPP
keywords: def2/J RIJCOSX
keywords: DEFGRID2
keywords: scfconv7
keywords: smallprint printgap noloewdin
keywords: NOSOSCF
formula: C22H19Cl2NO3
InChI: InChI=1/C22H19Cl2NO3/c1-22(2)17(12-19(23)24)20(22)21(26)28-18(13-25)14-7-6-10-16(11-14)27-15-8-4-3-5-9-15/h3-12,17-18,20H,1-2H3
47 atoms
Cl 4.352841 -2.725305 0.540075
Cl 3.912317 -5.569469 0.35132
O  -1.861997 -1.297216 0.531506
O  0.049581 -0.135882 0.503506
O  -1.911136 4.490628 -0.320171
N  -4.845375 -1.045872 1.918371
C  0.58068 -2.213045 -1.844566
C  1.452212 -2.478234 -0.650741
C  -0.042282 -2.326366 -0.464879
C  0.711096 -0.870527 -2.520196
C  0.251645 -3.327471 -2.80667
C  2.059931 -3.790586 -0.404086
C  -0.561234 -1.13884 0.231463
C  3.27313 -3.990263 0.094456
C  -2.522894 -0.170938 1.099846
C  -2.704394 0.939064 0.091744
C  -3.818824 -0.678931 1.551837
C  -2.227526 2.205157 0.39132
C  -3.309119 0.675781 -1.131908
C  -2.339302 3.213828 -0.556998
C  -3.428853 1.697868 -2.059699
C  -2.93899 2.965807 -1.783006
C  -0.775576 4.716013 0.420043
C  -0.792512 5.809226 1.274069
C  0.365366 3.93327 0.288144
C  0.346033 6.123161 2.002777
C  1.491901 4.252836 1.032958
C  1.489745 5.344745 1.891042
H  2.03602 -1.624361 -0.327128
H  -0.610387 -3.234426 -0.29751
H  -0.244863 -0.554285 -2.941486
H  1.423004 -0.949033 -3.343168
H  1.068228 -0.08475 -1.858026
H  -0.6426 -3.074703 -3.3783
H  0.063326 -4.279489 -2.312457
H  1.068333 -3.470841 -3.51607
H  1.47638 -4.673059 -0.637949
H  -1.989556 0.196639 1.982328
H  -1.765435 2.391487 1.352996
H  -3.68243 -0.313825 -1.364232
H  -3.897907 1.506297 -3.015248
H  -3.021849 3.75953 -2.514323
H  -1.688216 6.410822 1.363872
H  0.385642 3.082089 -0.381198
H  0.332064 6.977639 2.666632
H  2.379473 3.641765 0.934511
H  2.372998 5.587887 2.466247
elementType: Cl O N C H
totalener: -2050.67258051 hartree
nucrepener: 2742.05249715 hartree
electener: -4792.72507766 hartree
oneelecener: -8259.42171762 hartree
twoeener: 3466.69663996 hartree
cpcmener: -0.03673996 hartree
kineticenergy: 2044.45516803 hartree
xcener: -151.861892473035 hartree
chargesum: 0.0000000
charge: -0.057789 -0.061742 -0.276629 -0.461187 -0.338130 -0.100978 0.090952 0.028781 -0.066031 -0.261119 -0.268769 -0.206170 0.389207 0.042146 0.413902 0.026829 -0.218798 -0.205438 -0.243877 0.291313 -0.121960 -0.228595 0.293880 -0.254062 -0.195053 -0.123152 -0.148843 -0.188449 0.078728 0.102996 0.098110 0.102449 0.091104 0.099168 0.093771 0.102072 0.134511 0.142577 0.149284 0.149516 0.162644 0.150900 0.147877 0.159798 0.161348 0.161692 0.161217
qa: -0.0578 -0.0617 -0.2766 -0.4612 -0.3381 -0.1010 0.0910 0.0288 -0.0660 -0.2611 -0.2688 -0.2062 0.3892 0.0421 0.4139 0.0268 -0.2188 -0.2054 -0.2439 0.2913 -0.1220 -0.2286 0.2939 -0.2541 -0.1951 -0.1232 -0.1488 -0.1884 0.0787 0.1030 0.0981 0.1024 0.0911 0.0992 0.0938 0.1021 0.1345 0.1426 0.1493 0.1495 0.1626 0.1509 0.1479 0.1598 0.1613 0.1617 0.1612
va: 1.2678 1.2431 2.1349 2.0456 2.0723 3.1098 3.7426 3.8780 3.8247 3.9078 3.9059 3.9021 4.2004 4.2083 3.7213 3.5665 4.0807 3.9392 3.9677 3.7108 3.8980 4.0123 3.6747 4.0073 3.9028 3.8758 3.8923 3.9021 1.0492 1.0308 1.0006 1.0013 1.0140 1.0011 1.0052 1.0006 1.0171 1.0162 1.0054 1.0105 0.9880 1.0041 1.0077 0.9953 0.9879 0.9898 0.9893
dispcorr: -0.024440784 hartree
energy: -2050.697021295584
dipole: -15.77789 16.35106 0.57317 21.67833 -21.72627 -0.04794 -15.66714 14.15340 -1.51374
magnitude: 1.61933 au
magnitude: 4.11601 debye
