program: Gaussian 09
title: 000072626
version: EM64L-G09RevD.01
frameworkgroup: C1[X(C14H10N2O5)]
method: RPBEPBE
basis: SDD
operation: Freq
keyword: #p
keyword: freq=noraman
keyword: PBEPBE/SDD
title: #p freq=noraman PBEPBE/SDD
converged: YES YES NO NO
title: Mulliken charges:
elementType: O O O O O N N C C C C C C C C C C C C C C H H H H H H H H H H
charge: -0.242811 -0.478625 -0.254970 -0.430254 -0.327785 -0.065367 -0.615742 -0.023395 0.004756 0.319478 0.283975 0.339483 0.115104 0.130473 -0.541771 -0.381999 -0.420104 0.037350 -0.462429 -0.200079 0.164347 0.289827 0.266766 0.244083 0.216396 0.207355 0.240255 0.390660 0.355548 0.446338 0.393139
chargesum: 0.00000
title: Mulliken charges with hydrogens summed into heavy atoms:
elementType: O O O O O N N C C C C C C C C C C C C C C
charge: -0.242811 -0.032287 -0.254970 -0.037116 -0.327785 -0.065367 0.130465 -0.023395 0.004756 0.319478 0.283975 0.339483 0.115104 0.130473 -0.251944 -0.115233 -0.176021 0.037350 -0.038678 0.040176 0.164347
polarizability: 3.99527202e+02 -1.06386831e+01 2.09236935e+02 -8.58843541e-01 3.83055976e+00 7.47809253e+01
1716.lowfreq: -5.3696 -0.0004 0.0002 0.0005 2.6471 5.8341 38.4845 51.6335 78.1417
frequency: 38.4566 51.6263 78.1415 95.7323 125.5030 137.2222 153.4492 181.4260 208.5044 229.9346 271.4486 277.2298 297.9562 339.7140 353.6108 374.1729 380.4424 410.4543 422.9865 440.2234 480.7451 484.5970 509.7419 534.9619 549.9505 571.1770 602.3905 608.1858 623.7103 682.5306 685.3367 700.1361 712.8290 728.1664 752.3619 761.1443 766.6586 775.0239 785.8442 838.4510 841.0970 862.4577 870.4280 894.6540 938.7832 966.3970 973.8520 977.2716 1015.8049 1050.2910 1064.1099 1145.6549 1156.7981 1172.3767 1191.6007 1205.8479 1224.0308 1246.0551 1269.0291 1294.8342 1321.5216 1334.0868 1359.6353 1385.9312 1406.4144 1411.5876 1427.6247 1453.6009 1469.8552 1474.0925 1487.7404 1540.5276 1569.9227 1581.5570 1591.6436 1606.5686 1635.1154 2909.2687 3056.5847 3136.4560 3157.2028 3178.6733 3184.1153 3310.1762 3343.3893 3503.6764 3521.8367
redmass: 6.8452 7.5637 7.4187 4.5995 8.7477 7.2635 4.3166 5.7425 7.0368 4.1363 6.6110 6.0775 6.6537 7.4447 5.5571 3.7207 7.0144 8.1937 6.9038 6.2968 6.2925 4.4095 4.8530 3.9096 5.4458 8.2160 4.1296 1.4460 4.4638 6.8850 4.8699 5.3308 3.1883 1.8104 2.1169 1.4323 6.4625 3.3960 1.4776 1.1794 4.3677 1.6066 4.4701 1.4012 5.8396 1.8412 3.4960 1.6533 3.8298 2.4638 2.0194 3.5587 1.7915 1.2692 1.1534 3.1394 3.2140 1.7757 4.3180 2.4618 1.4577 3.1172 3.5829 3.3236 3.0510 1.9889 2.4815 1.3098 2.2603 3.4087 3.2414 9.2260 6.5979 4.3280 4.9396 6.0396 7.3753 1.0698 1.0904 1.0884 1.0921 1.0980 1.0929 1.0663 1.0480 1.0640 1.1025
irintensity: 1.7031 0.9759 0.9586 4.0811 2.4165 0.2885 6.4669 1.3057 0.5874 1.2051 3.3733 2.0858 2.0957 2.4691 3.4180 11.7113 6.3258 12.7301 2.3431 5.6254 0.9048 2.2160 14.4005 1.9533 2.0302 6.0491 27.3282 57.6696 17.5046 1.9089 9.5790 11.8784 17.4817 106.6156 119.0858 32.2123 14.7672 68.8952 49.9668 102.5774 2.9588 81.0014 0.8772 2.6756 35.5890 12.4634 37.8075 6.5520 18.4333 167.2507 79.6207 21.8387 54.6289 17.7957 39.0869 21.4415 0.4076 1.8376 26.6677 6.5180 3.5911 94.8802 35.6611 27.1735 29.5474 33.2569 8.1595 18.0162 60.5899 86.3524 272.8781 227.8350 21.4749 280.6254 681.3928 114.0603 17.0870 63.3712 50.8450 8.4113 14.4058 11.3936 0.2751 251.0910 234.1035 65.4020 107.9092
temp: 298.150 k
press: 1.00000 atm
elementType: 8 8 8 8 8 7 7 6 6 6 6 6 6 6 6 6 6 6 6 6 6 1 1 1 1 1 1 1 1 1 1
symmnumber: 1
zpe: 578647.8 jmol-1
zpe.correction: 0.220395 hartree
zpe.thermalcorrener: 0.237208 hartree
zpe.thermalcorrenthalpy: 0.238152 hartree
zpe.thermalcorrgfe: 0.176107 hartree
zpe.sumelectzpe: -1023.653858 hartree
zpe.sumelectthermal: -1023.637045 hartree
zpe.sumelectthermalent: -1023.636101 hartree
zpe.sumelectthermalfe: -1023.698146 hartree
dipole: -2.6616 -1.2385 1.1152
dipole: 3.1403
quadrupole: -107.9704 -125.3227 -123.0175
quadrupole: 16.0440 -3.7686 3.7252
quadrupole: 10.7998 -6.5526 -4.2473 16.0440 -3.7686 3.7252
hfenergy: -1023.8742529 hartree
pointgroup: C01 [X(C14H10N2O5)]
dipole: 1.0240998 -0.5143683 -0.461656 debye
polarizability: 399.2469138|7.7461466|208.6310324|-13.1828157|-8.1656095|75.667116 unknown
InChI: InChI=1S/C14H10N2O5/c15-11-7(18)4-9-13(10(11)14(19)20)16-12-6(5-17)2-1-3-8(12)21-9/h1-4,17,19H,5,15H2
charge 0 multiplicity 1
31 atoms
O  0.612967 -2.184218 0.131035
O  2.073923 2.884574 0.335347
O  -4.161862 -2.215889 0.210101
O  -0.831403 2.904081 0.115146
O  -3.116931 2.759951 -0.059507
N  0.585863 0.640958 -0.153754
N  -4.304429 0.429424 0.052892
C  1.790597 -0.066064 -0.145232
C  -0.578286 -0.011837 -0.012748
C  -0.601715 -1.490608 0.104994
C  1.826416 -1.481408 0.014964
C  3.022013 0.649639 -0.294608
C  -1.855952 0.686924 0.01168
C  -3.054494 -0.081541 0.063213
C  -1.752525 -2.244239 0.186091
C  3.024193 -2.212276 0.047092
C  4.224469 -0.081815 -0.259059
C  -3.039896 -1.598758 0.156162
C  2.996667 2.159171 -0.523556
C  4.229632 -1.493882 -0.089889
C  -1.998677 2.151119 0.005191
H  -1.708794 -3.333006 0.265238
H  3.002109 -3.297808 0.175081
H  5.177164 0.450152 -0.359052
H  3.998448 2.577464 -0.325675
H  2.760433 2.341905 -1.597987
H  5.182323 -2.032624 -0.061458
H  -4.419771 1.451372 -0.012142
H  -5.070746 -0.252239 0.111075
H  1.163056 2.476753 0.210821
H  -1.084997 3.867726 0.127346
