program: Orca
programVersion: 5.0.2
elementType: Cl Cl O O O N C C C C C C C C C C C C C C C C C C C C C C H H H H H H H H H H H H H H H H H H H
charge: 0
multiplicity: 1
keywords: wb97x-d3
keywords: def2-TZVPP
keywords: def2/J RIJCOSX
keywords: DEFGRID2
keywords: scfconv7
keywords: smallprint printgap noloewdin
keywords: NOSOSCF
formula: C22H19Cl2NO3
InChI: InChI=1/C22H19Cl2NO3/c1-22(2)17(12-19(23)24)20(22)21(26)28-18(13-25)14-7-6-10-16(11-14)27-15-8-4-3-5-9-15/h3-12,17-18,20H,1-2H3
47 atoms
Cl 1.6768 -5.725618 1.452671
Cl 2.940381 -6.586831 -0.99171
O  -1.360515 -0.695939 -1.536931
O  -1.463264 -1.717753 0.447397
O  0.277781 3.612825 0.485206
N  -3.382474 1.111398 -3.424266
C  1.672853 -1.635522 -0.154699
C  1.139854 -3.041394 -0.092141
C  0.45022 -2.023734 -0.96667
C  1.525168 -0.776098 1.076865
C  2.92544 -1.336706 -0.94006
C  1.843298 -4.157608 -0.736848
C  -0.872834 -1.506683 -0.58138
C  2.113432 -5.323294 -0.163172
C  -2.534798 0.031255 -1.200791
C  -2.262789 1.118311 -0.18515
C  -2.992621 0.624344 -2.457659
C  -1.127371 1.909707 -0.314651
C  -3.15684 1.330637 0.852843
C  -0.887087 2.906507 0.617165
C  -2.908042 2.343196 1.769879
C  -1.774265 3.13168 1.664395
C  0.278641 4.963857 0.74519
C  -0.70158 5.802962 0.230417
C  1.329659 5.471217 1.493493
C  -0.623052 7.16548 0.478906
C  1.400713 6.838244 1.725343
C  0.424722 7.689066 1.22574
H  0.62271 -3.283694 0.829341
H  0.616674 -2.094278 -2.036018
H  1.386959 0.272444 0.804781
H  2.433793 -0.843782 1.677216
H  0.694376 -1.073596 1.713453
H  2.967072 -0.274587 -1.186333
H  2.986057 -1.892634 -1.874426
H  3.810935 -1.574511 -0.348105
H  2.171642 -4.026599 -1.761264
H  -3.328434 -0.633219 -0.843763
H  -0.426418 1.758269 -1.12685
H  -4.037538 0.709198 0.950003
H  -3.59672 2.511474 2.586745
H  -1.582164 3.905575 2.396434
H  -1.515282 5.404676 -0.362831
H  2.086449 4.804445 1.886697
H  -1.385238 7.821083 0.078609
H  2.221622 7.235935 2.307475
H  0.480608 8.752745 1.41421
elementType: Cl O N C H
totalener: -2050.67246850 hartree
nucrepener: 2702.60468067 hartree
electener: -4753.27714918 hartree
oneelecener: -8180.62879544 hartree
twoeener: 3427.35164627 hartree
cpcmener: -0.03723896 hartree
kineticenergy: 2044.44904781 hartree
xcener: -151.859952279462 hartree
chargesum: -0.0000000
charge: -0.057156 -0.060942 -0.282319 -0.451668 -0.344638 -0.101625 0.101735 0.025902 -0.072414 -0.272838 -0.263455 -0.203995 0.369861 0.035763 0.431000 0.035431 -0.224648 -0.281183 -0.198809 0.260301 -0.131693 -0.166767 0.247597 -0.167005 -0.234993 -0.160011 -0.135583 -0.175133 0.081334 0.104035 0.097676 0.104975 0.097130 0.100010 0.092705 0.101971 0.137248 0.148320 0.140533 0.150287 0.163988 0.162949 0.160087 0.149518 0.162984 0.161562 0.161974
qa: -0.0572 -0.0609 -0.2823 -0.4517 -0.3446 -0.1016 0.1017 0.0259 -0.0724 -0.2728 -0.2635 -0.2040 0.3699 0.0358 0.4310 0.0354 -0.2246 -0.2812 -0.1988 0.2603 -0.1317 -0.1668 0.2476 -0.1670 -0.2350 -0.1600 -0.1356 -0.1751 0.0813 0.1040 0.0977 0.1050 0.0971 0.1000 0.0927 0.1020 0.1372 0.1483 0.1405 0.1503 0.1640 0.1629 0.1601 0.1495 0.1630 0.1616 0.1620
va: 1.2681 1.2442 2.1216 2.0539 2.0285 3.1097 3.7259 3.8860 3.8355 3.9028 3.9022 3.8862 4.2289 4.2053 3.6809 3.5801 4.0900 4.0344 3.9837 3.7137 3.8984 3.9152 3.7121 3.8897 4.0000 3.8921 3.8884 3.8860 1.0466 1.0313 1.0004 1.0017 1.0144 1.0016 1.0046 1.0012 1.0140 1.0141 1.0269 1.0012 0.9892 0.9926 0.9961 1.0065 0.9894 0.9883 0.9889
dispcorr: -0.024426574 hartree
energy: -2050.696895075668
dipole: -0.97958 1.66915 0.68958 42.16234 -40.94571 1.21663 5.47366 -4.51374 0.95991
magnitude: 1.69621 au
magnitude: 4.31142 debye
