program: Orca
programVersion: 5.0.2
elementType: Cl Cl O O O N C C C C C C C C C C C C C C C C C C C C C C H H H H H H H H H H H H H H H H H H H
charge: 0
multiplicity: 1
keywords: wb97x-d3
keywords: def2-TZVPP
keywords: def2/J RIJCOSX
keywords: DEFGRID2
keywords: scfconv7
keywords: smallprint printgap noloewdin
keywords: NOSOSCF
formula: C22H19Cl2NO3
InChI: InChI=1/C22H19Cl2NO3/c1-22(2)17(12-19(23)24)20(22)21(26)28-18(13-25)14-7-6-10-16(11-14)27-15-8-4-3-5-9-15/h3-12,17-18,20H,1-2H3
47 atoms
Cl 1.303535 -6.011699 1.124195
Cl 2.714659 -6.675043 -1.302588
O  -1.227767 -0.640855 -1.495248
O  -1.36569 -1.648217 0.494704
O  0.242948 3.723603 0.534378
N  -3.227609 1.077838 -3.473615
C  1.77278 -1.734056 -0.001823
C  1.164567 -3.105709 -0.08288
C  0.56519 -1.975371 -0.890219
C  1.630491 -0.978532 1.295879
C  3.068908 -1.441696 -0.716714
C  1.822466 -4.200509 -0.806682
C  -0.757319 -1.445541 -0.525474
C  1.924525 -5.452657 -0.380778
C  -2.42645 0.064216 -1.201938
C  -2.212805 1.163614 -0.186685
C  -2.857913 0.627725 -2.481989
C  -1.098386 1.987179 -0.290892
C  -3.135187 1.349331 0.831446
C  -0.906599 2.990654 0.645583
C  -2.934949 2.367588 1.753677
C  -1.821838 3.188459 1.674172
C  0.230257 5.066695 0.826376
C  -0.778543 5.906176 0.370927
C  1.304788 5.569678 1.544412
C  -0.705434 7.263107 0.651031
C  1.370072 6.931096 1.806939
C  0.365347 7.781841 1.367763
H  0.592861 -3.39604 0.791352
H  0.777385 -1.967393 -1.953305
H  2.511346 -1.155632 1.914783
H  0.761265 -1.277144 1.877604
H  1.565292 0.095915 1.113806
H  3.915451 -1.796479 -0.126302
H  3.186373 -0.365437 -0.851231
H  3.128193 -1.902044 -1.701585
H  2.258088 -3.977098 -1.773306
H  -3.216259 -0.615009 -0.864636
H  -0.376018 1.856662 -1.087878
H  -3.99926 0.702344 0.910215
H  -3.645222 2.514873 2.555903
H  -1.669411 3.96559 2.411938
H  -1.611104 5.514336 -0.199898
H  2.084532 4.902842 1.889783
H  -1.490509 7.918533 0.297587
H  2.210003 7.323792 2.36477
H  0.416635 8.841321 1.579694
elementType: Cl O N C H
totalener: -2050.67295751 hartree
nucrepener: 2689.56211519 hartree
electener: -4740.23507271 hartree
oneelecener: -8154.55923184 hartree
twoeener: 3414.32415913 hartree
cpcmener: -0.03720744 hartree
kineticenergy: 2044.45231060 hartree
xcener: -151.860776855036 hartree
chargesum: -0.0000000
charge: -0.057138 -0.061239 -0.283933 -0.456170 -0.341761 -0.100822 0.095250 0.032306 -0.070113 -0.269371 -0.264277 -0.203022 0.378026 0.037623 0.429240 0.023720 -0.224627 -0.265241 -0.199172 0.262844 -0.129683 -0.174620 0.262818 -0.178000 -0.240847 -0.155231 -0.132536 -0.179630 0.080306 0.102239 0.103161 0.095306 0.098902 0.102362 0.098886 0.093138 0.134536 0.147643 0.137032 0.150589 0.163731 0.162015 0.160181 0.149263 0.162871 0.161501 0.161943
qa: -0.0571 -0.0612 -0.2839 -0.4562 -0.3418 -0.1008 0.0952 0.0323 -0.0701 -0.2694 -0.2643 -0.2030 0.3780 0.0376 0.4292 0.0237 -0.2246 -0.2652 -0.1992 0.2628 -0.1297 -0.1746 0.2628 -0.1780 -0.2408 -0.1552 -0.1325 -0.1796 0.0803 0.1022 0.1032 0.0953 0.0989 0.1024 0.0989 0.0931 0.1345 0.1476 0.1370 0.1506 0.1637 0.1620 0.1602 0.1493 0.1629 0.1615 0.1619
va: 1.2683 1.2436 2.1224 2.0509 2.0416 3.1105 3.7325 3.8850 3.8352 3.9051 3.9049 3.8917 4.2104 4.2070 3.6886 3.6008 4.0889 4.0460 3.9804 3.7310 3.8967 3.9169 3.6987 3.8957 4.0018 3.8880 3.8864 3.8897 1.0476 1.0318 1.0010 1.0157 0.9997 1.0007 1.0016 1.0050 1.0160 1.0140 1.0285 1.0011 0.9894 0.9929 0.9960 1.0067 0.9893 0.9882 0.9890
dispcorr: -0.023819700 hartree
energy: -2050.696777210754
dipole: 0.98334 -0.20538 0.77796 42.59165 -41.36121 1.23044 8.45890 -7.32817 1.13073
magnitude: 1.84330 au
magnitude: 4.68530 debye
