program: Orca
programVersion: 5.0.2
elementType: Cl Cl O O O N C C C C C C C C C C C C C C C C C C C C C C H H H H H H H H H H H H H H H H H H H
charge: 0
multiplicity: 1
keywords: wb97x-d3
keywords: def2-TZVPP
keywords: def2/J RIJCOSX
keywords: DEFGRID2
keywords: scfconv7
keywords: smallprint printgap noloewdin
keywords: NOSOSCF
formula: C22H19Cl2NO3
InChI: InChI=1/C22H19Cl2NO3/c1-22(2)17(12-19(23)24)20(22)21(26)28-18(13-25)14-7-6-10-16(11-14)27-15-8-4-3-5-9-15/h3-12,17-18,20H,1-2H3
47 atoms
Cl -3.592598 3.957385 -2.845608
Cl -3.505551 6.389114 -1.296154
O  0.366788 0.887034 1.400792
O  -0.815113 0.268621 -0.395938
O  2.068094 -4.475739 -0.564988
N  1.097808 -0.480321 4.32056
C  0.415124 3.012088 -1.416198
C  -1.065173 3.127945 -1.185757
C  -0.18486 2.563288 -0.097275
C  0.896707 1.993012 -2.42033
C  1.279203 4.248801 -1.363056
C  -1.721738 4.4254 -0.970517
C  -0.275962 1.128564 0.240728
C  -2.794422 4.858646 -1.621302
C  0.472779 -0.473449 1.783332
C  1.529235 -1.210194 0.991422
C  0.820823 -0.458235 3.206234
C  1.280939 -2.509284 0.58142
C  2.741555 -0.596549 0.702527
C  2.262381 -3.210007 -0.110693
C  3.700061 -1.295909 -0.01205
C  3.47203 -2.602326 -0.414053
C  1.373796 -5.374912 0.196459
C  1.583571 -5.497613 1.564546
C  0.483285 -6.211015 -0.459577
C  0.885761 -6.46348 2.272735
C  -0.199097 -7.180267 0.260063
C  -0.006259 -7.307842 1.627393
H  -1.660097 2.389262 -1.710935
H  0.033198 3.207763 0.747479
H  0.216756 1.152854 -2.534783
H  1.873309 1.59655 -2.136054
H  1.00416 2.467556 -3.396499
H  2.314784 3.977866 -1.152658
H  0.967687 4.958187 -0.597182
H  1.258528 4.76986 -2.321426
H  -1.311191 5.091149 -0.221252
H  -0.490419 -0.983736 1.675704
H  0.325059 -2.973269 0.792514
H  2.939736 0.414852 1.031662
H  4.646032 -0.82605 -0.245323
H  4.2232 -3.154928 -0.962381
H  2.286861 -4.851499 2.074572
H  0.334934 -6.101796 -1.525835
H  1.049301 -6.558721 3.338039
H  -0.891337 -7.834158 -0.253643
H  -0.543937 -8.061365 2.186509
totalener: -2050.66050912 hartree
nucrepener: 2679.63988442 hartree
electener: -4730.30039354 hartree
oneelecener: -8134.42958092 hartree
twoeener: 3404.12918737 hartree
kineticenergy: 2044.53490070 hartree
xcener: -151.870638427870 hartree
chargesum: -0.0000000
charge: -0.038205 -0.042846 -0.265745 -0.354464 -0.297491 0.000184 0.067787 0.038892 -0.083376 -0.239485 -0.236961 -0.202432 0.306521 0.046630 0.304585 0.076718 -0.252951 -0.145629 -0.218291 0.204031 -0.090159 -0.184294 0.234990 -0.161845 -0.208975 -0.114152 -0.089161 -0.144733 0.089882 0.083142 0.102504 0.083655 0.092195 0.093832 0.072575 0.099477 0.100183 0.123224 0.115459 0.126814 0.128943 0.130171 0.136590 0.126847 0.130826 0.127220 0.127317
qa: -0.0382 -0.0428 -0.2657 -0.3545 -0.2975 0.0002 0.0678 0.0389 -0.0834 -0.2395 -0.2370 -0.2024 0.3065 0.0466 0.3046 0.0767 -0.2530 -0.1456 -0.2183 0.2040 -0.0902 -0.1843 0.2350 -0.1618 -0.2090 -0.1142 -0.0892 -0.1447 0.0899 0.0831 0.1025 0.0837 0.0922 0.0938 0.0726 0.0995 0.1002 0.1232 0.1155 0.1268 0.1289 0.1302 0.1366 0.1268 0.1308 0.1272 0.1273
va: 1.2892 1.2627 2.1158 2.1514 2.1117 3.1214 3.7721 3.8370 3.8474 3.9099 3.9047 3.9091 4.2935 4.2481 3.8367 3.6268 4.0189 3.9862 4.0045 3.8837 3.9366 4.0346 3.8061 3.9422 4.0407 3.9490 3.9333 3.9627 1.0477 1.0358 1.0191 1.0047 1.0027 1.0041 1.0097 1.0037 1.0273 1.0213 1.0147 1.0187 0.9989 1.0106 1.0029 1.0135 0.9994 0.9985 1.0002
dispcorr: -0.023690793 hartree
energy: -2050.684199913772
dipole: 26.54925 -25.85490 0.69435 -24.37198 24.34258 -0.02939 2.31390 -3.17004 -0.85614
magnitude: 1.10271 au
magnitude: 2.80286 debye
