program: Orca
programVersion: 5.0.2
elementType: Cl Cl O O O N C C C C C C C C C C C C C C C C C C C C C C H H H H H H H H H H H H H H H H H H H
charge: 0
multiplicity: 1
keywords: wb97x-d3
keywords: def2-TZVPP
keywords: def2/J RIJCOSX
keywords: DEFGRID2
keywords: scfconv7
keywords: smallprint printgap noloewdin
keywords: NOSOSCF
formula: C22H19Cl2NO3
InChI: InChI=1/C22H19Cl2NO3/c1-22(2)17(12-19(23)24)20(22)21(26)28-18(13-25)14-7-6-10-16(11-14)27-15-8-4-3-5-9-15/h3-12,17-18,20H,1-2H3
47 atoms
Cl -2.948841 0.082323 0.093561
Cl -4.331579 1.514652 2.183751
O  1.598833 1.398972 -0.621898
O  2.652365 2.379537 1.08915
O  0.787977 -3.670909 0.568008
N  2.678997 0.017767 -3.422785
C  -0.359579 3.77179 -0.36919
C  -0.940979 2.488129 0.146729
C  0.400716 2.970423 0.66788
C  0.087711 3.816621 -1.811025
C  -0.907784 5.09657 0.107801
C  -2.094076 2.446972 1.053948
C  1.664524 2.241472 0.423984
C  -3.00054 1.477718 1.096762
C  2.752369 0.605117 -0.877376
C  2.762607 -0.638045 -0.023255
C  2.697812 0.279499 -2.304619
C  1.741589 -1.573093 -0.170653
C  3.761799 -0.819226 0.916666
C  1.738565 -2.706095 0.628509
C  3.747181 -1.959422 1.710143
C  2.746818 -2.900431 1.571234
C  -0.170892 -3.621775 -0.411523
C  -1.449092 -3.206108 -0.077296
C  0.132721 -4.027729 -1.702547
C  -2.440227 -3.212804 -1.048596
C  -0.862909 -4.019844 -2.666978
C  -2.149931 -3.614514 -2.343425
H  -0.883604 1.660255 -0.548794
H  0.401774 3.40978 1.659027
H  0.933489 4.495524 -1.934224
H  -0.727094 4.192498 -2.431517
H  0.374116 2.845867 -2.206704
H  -1.804614 5.366225 -0.452119
H  -0.169244 5.884634 -0.045804
H  -1.162969 5.100866 1.166962
H  -2.230602 3.264622 1.750608
H  3.664371 1.183108 -0.699641
H  0.962332 -1.415554 -0.906373
H  4.53744 -0.075812 1.041412
H  4.52308 -2.112522 2.447913
H  2.731864 -3.790261 2.186655
H  -1.665551 -2.8917 0.935064
H  1.136684 -4.349939 -1.947066
H  -3.443857 -2.903006 -0.788287
H  -0.630433 -4.334612 -3.675326
H  -2.924881 -3.615899 -3.097942
totalener: -2050.65946759 hartree
nucrepener: 2870.97638268 hartree
electener: -4921.63585028 hartree
oneelecener: -8517.31969349 hartree
twoeener: 3595.68384321 hartree
kineticenergy: 2044.53278839 hartree
xcener: -151.871246416096 hartree
chargesum: 0.0000000
charge: -0.050520 -0.044885 -0.274373 -0.348435 -0.294912 -0.000260 0.070985 0.060511 -0.084214 -0.245994 -0.260840 -0.223865 0.352812 0.070265 0.301717 0.000379 -0.274512 -0.182523 -0.139259 0.248600 -0.080056 -0.207309 0.214673 -0.168685 -0.150149 -0.138812 -0.117402 -0.114624 0.084443 0.083921 0.093444 0.089223 0.096286 0.100101 0.096934 0.075262 0.097115 0.122352 0.118558 0.112377 0.126865 0.127280 0.129483 0.130399 0.139349 0.129476 0.128822
qa: -0.0505 -0.0449 -0.2744 -0.3484 -0.2949 -0.0003 0.0710 0.0605 -0.0842 -0.2460 -0.2608 -0.2239 0.3528 0.0703 0.3017 0.0004 -0.2745 -0.1825 -0.1393 0.2486 -0.0801 -0.2073 0.2147 -0.1687 -0.1501 -0.1388 -0.1174 -0.1146 0.0844 0.0839 0.0934 0.0892 0.0963 0.1001 0.0969 0.0753 0.0971 0.1224 0.1186 0.1124 0.1269 0.1273 0.1295 0.1304 0.1393 0.1295 0.1288
va: 1.2926 1.2615 2.1114 2.1616 2.1210 3.1149 3.7529 3.7842 3.8422 3.9200 3.9216 3.9464 4.2655 4.2463 3.8663 3.7004 4.0168 3.9594 4.0004 3.8522 3.9540 4.0384 3.8325 3.9879 3.9982 3.8900 3.9557 3.9547 1.0404 1.0306 1.0016 1.0028 1.0128 1.0017 1.0031 1.0103 1.0324 1.0197 1.0268 1.0182 0.9995 1.0134 1.0176 1.0057 1.0017 0.9995 0.9998
dispcorr: -0.026120229 hartree
energy: -2050.685587821442
dipole: 13.91285 -14.30029 -0.38744 9.57351 -8.93313 0.64038 -9.26027 9.73962 0.47934
magnitude: 0.88880 au
magnitude: 2.25915 debye
