program: Orca
programVersion: 5.0.2
elementType: Cl Cl O O O N C C C C C C C C C C C C C C C C C C C C C C H H H H H H H H H H H H H H H H H H H
charge: 0
multiplicity: 1
keywords: wb97x-d3
keywords: def2-TZVPP
keywords: def2/J RIJCOSX
keywords: DEFGRID2
keywords: scfconv7
keywords: smallprint printgap noloewdin
keywords: NOSOSCF
formula: C22H19Cl2NO3
InChI: InChI=1/C22H19Cl2NO3/c1-22(2)17(12-19(23)24)20(22)21(26)28-18(13-25)14-7-6-10-16(11-14)27-15-8-4-3-5-9-15/h3-12,17-18,20H,1-2H3
47 atoms
Cl -3.863999 3.955983 0.854626
Cl -3.107868 6.209315 -0.778735
O  1.703324 1.003759 -0.15051
O  -0.207715 0.350623 0.823291
O  1.228706 -4.427789 -0.465557
N  4.605629 1.514761 1.353749
C  -1.435475 1.411712 -1.861798
C  -1.654201 2.404032 -0.75848
C  -0.259174 1.872828 -1.020712
C  -2.01428 0.027836 -1.691722
C  -1.440577 1.878142 -3.298531
C  -1.938759 3.820107 -1.023393
C  0.366452 0.99455 -0.012342
C  -2.848306 4.554284 -0.394131
C  2.461041 0.164376 0.719983
C  2.777938 -1.147184 0.041811
C  3.662698 0.925437 1.066816
C  1.867172 -2.190293 0.168108
C  3.912396 -1.296495 -0.744014
C  2.099997 -3.386247 -0.498325
C  4.132212 -2.495873 -1.402934
C  3.235535 -3.542852 -1.282887
C  0.479822 -4.669333 0.652884
C  1.05179 -4.721593 1.917728
C  -0.870905 -4.925507 0.476678
C  0.254605 -5.026382 3.009745
C  -1.65487 -5.238648 1.576946
C  -1.098752 -5.285324 2.846224
H  -2.12595 1.993511 0.126959
H  0.432651 2.538359 -1.524432
H  -3.023509 0.005468 -2.10569
H  -2.075353 -0.285134 -0.652854
H  -1.418628 -0.710128 -2.232151
H  -0.932416 1.150509 -3.932743
H  -0.941208 2.835452 -3.442852
H  -2.464075 1.981507 -3.66208
H  -1.364581 4.323009 -1.791632
H  1.90612 -0.019963 1.644483
H  0.977919 -2.063302 0.772881
H  4.628307 -0.490431 -0.838344
H  5.018152 -2.620095 -2.010813
H  3.40549 -4.482388 -1.791799
H  2.109839 -4.53383 2.049271
H  -1.297142 -4.885996 -0.517038
H  0.69929 -5.068705 3.995106
H  -2.708569 -5.440932 1.438097
H  -1.714168 -5.525248 3.702411
totalener: -2050.66198068 hartree
nucrepener: 2716.17870167 hartree
electener: -4766.84068235 hartree
oneelecener: -8207.55271690 hartree
twoeener: 3440.71203456 hartree
kineticenergy: 2044.52505028 hartree
xcener: -151.869778940655 hartree
chargesum: 0.0000000
charge: -0.038606 -0.043691 -0.255194 -0.385662 -0.297355 -0.002934 0.067641 0.048729 -0.103057 -0.252459 -0.242593 -0.205084 0.369541 0.051504 0.308481 -0.007006 -0.252420 -0.154702 -0.176018 0.217971 -0.086338 -0.206872 0.241698 -0.165598 -0.205835 -0.109412 -0.090013 -0.140554 0.087346 0.082600 0.091237 0.102662 0.088969 0.095236 0.073147 0.099986 0.097828 0.126669 0.148050 0.122853 0.130652 0.130016 0.132770 0.123953 0.128661 0.126135 0.127070
qa: -0.0386 -0.0437 -0.2552 -0.3857 -0.2974 -0.0029 0.0676 0.0487 -0.1031 -0.2525 -0.2426 -0.2051 0.3695 0.0515 0.3085 -0.0070 -0.2524 -0.1547 -0.1760 0.2180 -0.0863 -0.2069 0.2417 -0.1656 -0.2058 -0.1094 -0.0900 -0.1406 0.0873 0.0826 0.0912 0.1027 0.0890 0.0952 0.0731 0.1000 0.0978 0.1267 0.1481 0.1229 0.1307 0.1300 0.1328 0.1240 0.1287 0.1261 0.1271
va: 1.2887 1.2616 2.1276 2.1152 2.1131 3.1150 3.7584 3.8190 3.8824 3.9155 3.9088 3.9200 4.2239 4.2509 3.8235 3.7537 4.0230 3.8685 4.0411 3.8624 3.9491 4.0508 3.8052 3.9558 4.0443 3.9470 3.9351 3.9663 1.0495 1.0356 1.0020 1.0198 1.0018 1.0041 1.0103 1.0026 1.0303 1.0215 1.0177 1.0192 0.9994 1.0117 1.0038 1.0139 0.9996 0.9989 1.0001
dispcorr: -0.023275837 hartree
energy: -2050.685256516630
dipole: 8.83900 -9.49550 -0.65649 -33.67044 32.53608 -1.13436 -10.05051 9.05573 -0.99478
magnitude: 1.64540 au
magnitude: 4.18228 debye
