program: Orca
programVersion: 5.0.2
elementType: Cl Cl O O O N C C C C C C C C C C C C C C C C C C C C C C H H H H H H H H H H H H H H H H H H H
charge: 0
multiplicity: 1
keywords: wb97x-d3
keywords: def2-TZVPP
keywords: def2/J RIJCOSX
keywords: DEFGRID2
keywords: scfconv7
keywords: smallprint printgap noloewdin
keywords: NOSOSCF
formula: C22H19Cl2NO3
InChI: InChI=1/C22H19Cl2NO3/c1-22(2)17(12-19(23)24)20(22)21(26)28-18(13-25)14-7-6-10-16(11-14)27-15-8-4-3-5-9-15/h3-12,17-18,20H,1-2H3
47 atoms
Cl -2.09108 0.082701 0.266078
Cl -4.113313 1.573099 1.686999
O  2.0708 2.002199 -0.556045
O  2.501149 2.464904 1.588313
O  -0.407755 -2.350623 -0.504388
N  3.832918 0.692712 -3.023639
C  -0.076156 4.140885 -0.534455
C  -0.68654 2.844624 -0.104263
C  0.551667 3.380831 0.613278
C  0.562465 4.214782 -1.902038
C  -0.738898 5.442868 -0.144037
C  -1.955735 2.743922 0.628655
C  1.802332 2.595943 0.623676
C  -2.624102 1.613827 0.829047
C  3.070013 0.993263 -0.542592
C  2.513286 -0.293558 0.016949
C  3.48777 0.83402 -1.937357
C  1.343735 -0.809815 -0.522974
C  3.13403 -0.928088 1.080424
C  0.782296 -1.95407 0.018561
C  2.575194 -2.086434 1.599987
C  1.398994 -2.602996 1.083362
C  -0.746065 -3.675632 -0.526239
C  -2.011122 -4.022948 -0.079404
C  0.117832 -4.636991 -1.034479
C  -2.417278 -5.347137 -0.148711
C  -0.297609 -5.957882 -1.087937
C  -1.562879 -6.318985 -0.647162
H  -0.483468 2.012333 -0.767883
H  0.371001 3.811181 1.591314
H  1.407248 4.905236 -1.900859
H  -0.16911 4.591822 -2.618323
H  0.914078 3.256127 -2.270729
H  -1.567408 5.669065 -0.817037
H  -0.022454 6.262312 -0.212776
H  -1.12512 5.442457 0.874983
H  -2.387543 3.64432 1.047171
H  3.940488 1.310713 0.040056
H  0.851279 -0.327637 -1.358579
H  4.03456 -0.514177 1.514378
H  3.049001 -2.583303 2.435719
H  0.960841 -3.493456 1.514671
H  -2.670087 -3.257322 0.309097
H  1.100223 -4.356707 -1.393002
H  -3.406602 -5.618099 0.195121
H  0.372185 -6.708357 -1.486184
H  -1.881864 -7.3511 -0.697088
totalener: -2050.65701637 hartree
nucrepener: 2868.30238182 hartree
electener: -4918.95939819 hartree
oneelecener: -8511.99278589 hartree
twoeener: 3593.03338770 hartree
kineticenergy: 2044.54738901 hartree
xcener: -151.874374164544 hartree
chargesum: 0.0000000
charge: -0.040523 -0.046524 -0.277767 -0.340911 -0.312752 0.002142 0.100431 0.003916 -0.053597 -0.231050 -0.278377 -0.202594 0.314144 0.064530 0.299532 0.090054 -0.270368 -0.266989 -0.133728 0.226640 -0.096360 -0.167444 0.235248 -0.193718 -0.154982 -0.102563 -0.118617 -0.136012 0.077917 0.088060 0.092385 0.086827 0.093319 0.103736 0.097986 0.075825 0.099894 0.123341 0.131432 0.109938 0.128976 0.136580 0.121530 0.136657 0.127855 0.128814 0.127161
qa: -0.0405 -0.0465 -0.2778 -0.3409 -0.3128 0.0021 0.1004 0.0039 -0.0536 -0.2310 -0.2784 -0.2026 0.3141 0.0645 0.2995 0.0901 -0.2704 -0.2670 -0.1337 0.2266 -0.0964 -0.1674 0.2352 -0.1937 -0.1550 -0.1026 -0.1186 -0.1360 0.0779 0.0881 0.0924 0.0868 0.0933 0.1037 0.0980 0.0758 0.0999 0.1233 0.1314 0.1099 0.1290 0.1366 0.1215 0.1367 0.1279 0.1288 0.1272
va: 1.3209 1.2613 2.0983 2.1680 2.0681 3.1145 3.7656 3.8416 3.7965 3.9027 3.9308 3.9228 4.2973 4.2520 3.8792 3.5976 4.0179 4.0630 4.0202 3.8237 3.9615 3.9840 3.8014 4.0292 3.9694 3.9578 3.9535 3.9543 1.0369 1.0290 1.0040 1.0018 1.0158 0.9997 1.0040 1.0076 1.0314 1.0178 1.0265 1.0146 1.0009 1.0036 1.0204 1.0030 0.9997 0.9996 0.9999
dispcorr: -0.026650230 hartree
energy: -2050.683666604714
dipole: 11.40566 -11.99352 -0.58786 4.42427 -4.41549 0.00878 -6.33410 7.04556 0.71146
magnitude: 0.92295 au
magnitude: 2.34596 debye
