program: Orca
programVersion: 5.0.2
elementType: Cl Cl O O O N C C C C C C C C C C C C C C C C C C C C C C H H H H H H H H H H H H H H H H H H H
charge: 0
multiplicity: 1
keywords: wb97x-d3
keywords: def2-TZVPP
keywords: def2/J RIJCOSX
keywords: DEFGRID2
keywords: scfconv7
keywords: smallprint printgap noloewdin
keywords: NOSOSCF
formula: C22H19Cl2NO3
InChI: InChI=1/C22H19Cl2NO3/c1-22(2)17(12-19(23)24)20(22)21(26)28-18(13-25)14-7-6-10-16(11-14)27-15-8-4-3-5-9-15/h3-12,17-18,20H,1-2H3
47 atoms
Cl -0.308899 6.512396 -0.368456
Cl -2.585136 6.57385 -2.137448
O  0.670226 0.374143 -1.340249
O  1.485586 1.741622 0.231668
O  -0.200249 -3.962327 1.140322
N  2.072954 -1.586553 -3.615092
C  -1.548317 2.351889 0.724875
C  -0.949257 3.442052 -0.11245
C  -0.77293 1.993778 -0.527805
C  -0.961255 2.110177 2.094629
C  -3.036219 2.09671 0.673939
C  -1.765206 4.324627 -0.954859
C  0.57548 1.397053 -0.469357
C  -1.570665 5.62662 -1.124668
C  1.889406 -0.353889 -1.318566
C  1.922512 -1.350985 -0.185833
C  1.973019 -1.035067 -2.612532
C  0.868187 -2.242308 -0.035435
C  2.995742 -1.380891 0.689085
C  0.889555 -3.161086 1.000415
C  3.014449 -2.316492 1.713567
C  1.96721 -3.205574 1.880098
C  -0.039867 -5.271703 1.49958
C  -0.928212 -5.791423 2.428796
C  0.933518 -6.077756 0.92272
C  -0.843625 -7.130237 2.779254
C  1.012465 -7.411996 1.290089
C  0.128349 -7.944153 2.217647
H  -0.058631 3.894648 0.308329
H  -1.376001 1.650047 -1.360654
H  -1.498949 2.712494 2.828481
H  0.092129 2.368036 2.161458
H  -1.070091 1.063107 2.382585
H  -3.454548 2.170947 -0.32914
H  -3.56704 2.808168 1.308314
H  -3.25699 1.093612 1.041059
H  -2.597694 3.89061 -1.494594
H  2.744972 0.324639 -1.239336
H  0.02572 -2.23238 -0.716263
H  3.808436 -0.674892 0.580366
H  3.847988 -2.343498 2.402197
H  1.984343 -3.922656 2.690551
H  -1.68232 -5.149209 2.864157
H  1.617711 -5.67309 0.187776
H  -1.539817 -7.535533 3.501433
H  1.768148 -8.04095 0.838431
H  0.193677 -8.987087 2.496045
totalener: -2050.66130084 hartree
nucrepener: 2661.70185651 hartree
electener: -4712.36315735 hartree
oneelecener: -8098.62972664 hartree
twoeener: 3386.26656929 hartree
kineticenergy: 2044.54170725 hartree
xcener: -151.871745027976 hartree
chargesum: 0.0000000
charge: -0.038846 -0.043463 -0.271257 -0.368982 -0.299281 0.000068 0.068264 0.039763 -0.084413 -0.244935 -0.245863 -0.201330 0.335001 0.050788 0.330244 0.032772 -0.260582 -0.204087 -0.129899 0.177963 -0.109574 -0.140050 0.218271 -0.200102 -0.142353 -0.097520 -0.122907 -0.137183 0.086814 0.082636 0.090059 0.102384 0.089431 0.073816 0.100218 0.095305 0.097207 0.122288 0.124107 0.111380 0.130417 0.136574 0.125893 0.137605 0.126361 0.129797 0.127197
qa: -0.0388 -0.0435 -0.2713 -0.3690 -0.2993 0.0001 0.0683 0.0398 -0.0844 -0.2449 -0.2459 -0.2013 0.3350 0.0508 0.3302 0.0328 -0.2606 -0.2041 -0.1299 0.1780 -0.1096 -0.1400 0.2183 -0.2001 -0.1424 -0.0975 -0.1229 -0.1372 0.0868 0.0826 0.0901 0.1024 0.0894 0.0738 0.1002 0.0953 0.0972 0.1223 0.1241 0.1114 0.1304 0.1366 0.1259 0.1376 0.1264 0.1298 0.1272
va: 1.2886 1.2617 2.1254 2.1360 2.1010 3.1199 3.7574 3.8434 3.8627 3.9133 3.9101 3.9217 4.2519 4.2525 3.8217 3.6542 4.0285 4.0623 4.0131 3.9060 3.9611 3.9448 3.8203 4.0317 3.9322 3.9433 3.9506 3.9544 1.0497 1.0353 1.0011 1.0213 1.0020 1.0100 1.0022 1.0042 1.0310 1.0193 1.0307 1.0140 1.0010 1.0019 1.0131 1.0024 0.9989 0.9996 0.9999
dispcorr: -0.022899756 hartree
energy: -2050.684200593970
dipole: -0.67718 0.23384 -0.44333 -39.26551 38.60227 -0.66324 21.33905 -19.70217 1.63689
magnitude: 1.82094 au
magnitude: 4.62846 debye
