program: Orca
programVersion: 5.0.2
elementType: Cl Cl O O O N C C C C C C C C C C C C C C C C C C C C C C H H H H H H H H H H H H H H H H H H H
charge: 0
multiplicity: 1
keywords: wb97x-d3
keywords: def2-TZVPP
keywords: def2/J RIJCOSX
keywords: DEFGRID2
keywords: scfconv7
keywords: smallprint printgap noloewdin
keywords: NOSOSCF
formula: C22H19Cl2NO3
InChI: InChI=1/C22H19Cl2NO3/c1-22(2)17(12-19(23)24)20(22)21(26)28-18(13-25)14-7-6-10-16(11-14)27-15-8-4-3-5-9-15/h3-12,17-18,20H,1-2H3
47 atoms
Cl -0.806235 1.952433 -3.617636
Cl -3.582071 2.723747 -3.750424
O  1.185341 1.427584 0.435187
O  -0.158624 0.432775 1.919137
O  0.986042 -4.330605 0.739887
N  4.406864 1.430452 -0.25787
C  -0.817235 3.76663 0.601187
C  -0.938659 2.976315 -0.665152
C  -1.003259 2.264426 0.677016
C  0.511939 4.412986 0.911565
C  -1.987516 4.587289 1.091651
C  -2.126805 3.017171 -1.527516
C  0.022079 1.284245 1.093943
C  -2.159912 2.616333 -2.792625
C  2.174371 0.429286 0.658509
C  1.817043 -0.855717 -0.046609
C  3.420047 0.999799 0.141558
C  1.603598 -2.000233 0.702886
C  1.648607 -0.868017 -1.425619
C  1.200377 -3.169465 0.069404
C  1.266844 -2.044383 -2.047835
C  1.033991 -3.192954 -1.308043
C  0.469765 -4.324614 2.005749
C  0.954284 -5.283861 2.883105
C  -0.531206 -3.44623 2.402329
C  0.430451 -5.366281 4.163656
C  -1.036042 -3.533203 3.690425
C  -0.562111 -4.489701 4.575864
H  -0.005267 2.838044 -1.196688
H  -1.986719 1.952318 1.009164
H  0.667461 4.480684 1.98947
H  0.522483 5.428641 0.513527
H  1.359601 3.887428 0.480589
H  -2.948113 4.090136 0.959549
H  -2.03136 5.544523 0.569764
H  -1.880183 4.794043 2.157054
H  -3.05291 3.402065 -1.119567
H  2.304349 0.246048 1.729947
H  1.725708 -1.972263 1.777995
H  1.811344 0.028594 -2.009879
H  1.134652 -2.067069 -3.120907
H  0.721703 -4.109568 -1.790663
H  1.731912 -5.961559 2.556152
H  -0.912647 -2.693718 1.724478
H  0.808322 -6.118059 4.843897
H  -1.810954 -2.844034 3.998131
H  -0.964134 -4.551461 5.577886
totalener: -2050.65796008 hartree
nucrepener: 2793.09134694 hartree
electener: -4843.74930701 hartree
oneelecener: -8361.39873552 hartree
twoeener: 3517.64942851 hartree
kineticenergy: 2044.54189198 hartree
xcener: -151.873504718902 hartree
chargesum: 0.0000000
charge: -0.045057 -0.041906 -0.270450 -0.353616 -0.296907 0.002872 0.077384 0.027803 -0.064032 -0.243992 -0.273498 -0.201578 0.347840 0.055406 0.293195 0.033249 -0.267168 -0.154749 -0.188543 0.246107 -0.088266 -0.198266 0.264050 -0.223880 -0.171374 -0.084310 -0.105926 -0.150837 0.085129 0.086475 0.092534 0.089825 0.097810 0.075717 0.103737 0.097136 0.100035 0.118885 0.121347 0.116198 0.127951 0.128889 0.125036 0.131165 0.125396 0.128039 0.125149
qa: -0.0451 -0.0419 -0.2705 -0.3536 -0.2969 0.0029 0.0774 0.0278 -0.0640 -0.2440 -0.2735 -0.2016 0.3478 0.0554 0.2932 0.0332 -0.2672 -0.1547 -0.1885 0.2461 -0.0883 -0.1983 0.2640 -0.2239 -0.1714 -0.0843 -0.1059 -0.1508 0.0851 0.0865 0.0925 0.0898 0.0978 0.0757 0.1037 0.0971 0.1000 0.1189 0.1213 0.1162 0.1280 0.1289 0.1250 0.1312 0.1254 0.1280 0.1251
va: 1.2866 1.2644 2.1115 2.1536 2.1201 3.1134 3.7834 3.8016 3.8152 3.9116 3.9245 3.9101 4.2512 4.2546 3.8761 3.6105 4.0119 3.9325 4.0309 3.8660 3.9510 4.0432 3.7838 4.0467 3.9402 3.9278 3.9469 3.9641 1.0426 1.0282 1.0019 1.0027 1.0127 1.0088 1.0003 1.0039 1.0323 1.0184 1.0160 1.0215 1.0003 1.0116 1.0144 1.0110 0.9987 0.9997 1.0004
dispcorr: -0.025184421 hartree
energy: -2050.683144496323
dipole: 3.30283 -4.52039 -1.21756 -0.54144 0.92887 0.38743 29.45567 -28.72734 0.72832
magnitude: 1.47072 au
magnitude: 3.73826 debye
