program: Orca
programVersion: 5.0.2
elementType: Cl Cl O O O N C C C C C C C C C C C C C C C C C C C C C C H H H H H H H H H H H H H H H H H H H
charge: 0
multiplicity: 1
keywords: wb97x-d3
keywords: def2-TZVPP
keywords: def2/J RIJCOSX
keywords: DEFGRID2
keywords: scfconv7
keywords: smallprint printgap noloewdin
keywords: NOSOSCF
formula: C22H19Cl2NO3
InChI: InChI=1/C22H19Cl2NO3/c1-22(2)17(12-19(23)24)20(22)21(26)28-18(13-25)14-7-6-10-16(11-14)27-15-8-4-3-5-9-15/h3-12,17-18,20H,1-2H3
47 atoms
Cl -3.280698 1.031478 -1.590801
Cl -4.738087 0.48378 0.840026
O  1.775945 1.486294 -0.222318
O  2.347495 1.930106 1.892146
O  1.229412 -3.604246 0.030258
N  3.464475 1.019643 -3.024338
C  -0.561764 3.430783 0.362042
C  -0.998403 1.995715 0.275264
C  0.124847 2.377491 1.209635
C  0.127721 4.046153 -0.83111
C  -1.425988 4.413924 1.114292
C  -2.273286 1.525773 0.844999
C  1.52032 1.922653 1.026091
C  -3.294199 1.083622 0.122596
C  3.062521 0.930006 -0.443457
C  3.155414 -0.491798 0.058335
C  3.271135 0.984523 -1.892709
C  2.110028 -1.370861 -0.196711
C  4.28247 -0.909865 0.745011
C  2.200563 -2.681438 0.249694
C  4.369256 -2.229065 1.167768
C  3.335216 -3.114861 0.92866
C  -0.055612 -3.172661 -0.18094
C  -0.769704 -2.57739 0.850304
C  -0.634716 -3.373808 -1.422819
C  -2.079612 -2.18361 0.629136
C  -1.949232 -2.977969 -1.630782
C  -2.672587 -2.379702 -0.610715
H  -0.697571 1.487361 -0.633823
H  -0.120689 2.428523 2.26503
H  -0.613711 4.526064 -1.471448
H  0.664577 3.324639 -1.441354
H  0.834815 4.815423 -0.515197
H  -1.88684 3.982277 2.002152
H  -2.229563 4.781396 0.474261
H  -0.834721 5.272588 1.435503
H  -2.393975 1.522471 1.921617
H  3.83674 1.539804 0.033776
H  1.234777 -1.037388 -0.740236
H  5.083931 -0.21427 0.957324
H  5.244905 -2.565584 1.70624
H  3.393099 -4.141171 1.266137
H  -0.305258 -2.433042 1.817493
H  -0.061627 -3.839224 -2.213895
H  -2.644169 -1.726067 1.430466
H  -2.404897 -3.133213 -2.599772
H  -3.695025 -2.069158 -0.776993
totalener: -2050.65791945 hartree
nucrepener: 2926.25397437 hartree
electener: -4976.91189382 hartree
oneelecener: -8627.61644474 hartree
twoeener: 3650.70455092 hartree
kineticenergy: 2044.53880142 hartree
xcener: -151.872941890188 hartree
chargesum: -0.0000000
charge: -0.035292 -0.045701 -0.279932 -0.334800 -0.298170 0.002661 0.111332 0.018794 -0.112016 -0.259721 -0.235074 -0.197963 0.325259 0.032735 0.275741 0.058907 -0.261671 -0.146075 -0.159545 0.189338 -0.086146 -0.192978 0.210393 -0.153169 -0.177354 -0.108621 -0.107059 -0.133571 0.098251 0.082851 0.090050 0.097854 0.095233 0.073804 0.097314 0.097532 0.109636 0.126485 0.127830 0.106851 0.126934 0.128950 0.130163 0.128596 0.123411 0.128302 0.129652
qa: -0.0353 -0.0457 -0.2799 -0.3348 -0.2982 0.0027 0.1113 0.0188 -0.1120 -0.2597 -0.2351 -0.1980 0.3253 0.0327 0.2757 0.0589 -0.2617 -0.1461 -0.1595 0.1893 -0.0861 -0.1930 0.2104 -0.1532 -0.1774 -0.1086 -0.1071 -0.1336 0.0983 0.0829 0.0901 0.0979 0.0952 0.0738 0.0973 0.0975 0.1096 0.1265 0.1278 0.1069 0.1269 0.1290 0.1302 0.1286 0.1234 0.1283 0.1297
va: 1.2902 1.2606 2.0943 2.1750 2.1118 3.1164 3.7365 3.7625 3.9120 3.9257 3.9146 3.8498 4.2695 4.2296 3.8795 3.6676 4.0104 3.9093 4.0338 3.8846 3.9601 4.0292 3.8378 4.0071 4.0311 3.8643 3.9820 3.8848 1.0287 1.0339 1.0043 1.0121 1.0009 1.0080 1.0041 1.0041 1.0191 1.0203 1.0206 1.0127 0.9996 1.0119 1.0062 1.0104 1.0083 0.9999 1.0153
dispcorr: -0.029087603 hartree
energy: -2050.687007051014
dipole: 13.75387 -14.37288 -0.61901 8.96694 -8.56769 0.39925 5.93239 -4.92077 1.01161
magnitude: 1.25137 au
magnitude: 3.18074 debye
