program: Orca
programVersion: 5.0.2
elementType: Cl Cl O O O N C C C C C C C C C C C C C C C C C C C C C C H H H H H H H H H H H H H H H H H H H
charge: 0
multiplicity: 1
keywords: wb97x-d3
keywords: def2-TZVPP
keywords: def2/J RIJCOSX
keywords: DEFGRID2
keywords: scfconv7
keywords: smallprint printgap noloewdin
keywords: NOSOSCF
formula: C22H19Cl2NO3
InChI: InChI=1/C22H19Cl2NO3/c1-22(2)17(12-19(23)24)20(22)21(26)28-18(13-25)14-7-6-10-16(11-14)27-15-8-4-3-5-9-15/h3-12,17-18,20H,1-2H3
47 atoms
Cl -0.550496 4.486317 0.504807
Cl -2.665973 5.997392 -0.750169
O  1.316091 0.855921 -0.479015
O  -0.173093 0.25331 1.08274
O  1.338762 -4.601862 0.671162
N  4.528279 1.563119 -0.182776
C  -2.212444 0.843143 -1.222922
C  -2.181623 1.980143 -0.258233
C  -0.88344 1.479607 -0.844034
C  -2.58673 -0.528432 -0.717567
C  -2.663842 1.098441 -2.641094
C  -2.681015 3.324193 -0.622815
C  0.078843 0.796046 0.040873
C  -2.048899 4.452439 -0.327937
C  2.352318 0.177668 0.227701
C  2.478583 -1.246737 -0.255787
C  3.56929 0.955643 -0.010448
C  1.852356 -2.254496 0.466083
C  3.157922 -1.540515 -1.431212
C  1.901162 -3.562757 -0.000291
C  3.212298 -2.851242 -1.876052
C  2.582892 -3.86382 -1.171816
C  0.199279 -4.404799 1.401838
C  0.159899 -4.921927 2.687287
C  -0.90651 -3.758846 0.864257
C  -0.998098 -4.791994 3.439529
C  -2.05349 -3.627678 1.62994
C  -2.105811 -4.141769 2.917792
H  -2.331254 1.706314 0.783638
H  -0.430248 2.089744 -1.616642
H  -2.123337 -1.30507 -1.32954
H  -3.668414 -0.657876 -0.786596
H  -2.295083 -0.694461 0.31662
H  -3.749542 1.012059 -2.720456
H  -2.224977 0.364262 -3.318198
H  -2.381199 2.088308 -3.000772
H  -3.631062 3.402573 -1.138208
H  2.153216 0.191217 1.303449
H  1.32352 -2.016144 1.380258
H  3.653186 -0.758064 -1.99151
H  3.746708 -3.088463 -2.786038
H  2.620082 -4.888188 -1.518299
H  1.030171 -5.424556 3.088251
H  -0.873907 -3.361192 -0.142181
H  -1.028699 -5.19707 4.442369
H  -2.915104 -3.124475 1.210843
H  -3.005055 -4.037579 3.509482
totalener: -2050.65958341 hartree
nucrepener: 2807.61385478 hartree
electener: -4858.27343819 hartree
oneelecener: -8390.48166176 hartree
twoeener: 3532.20822357 hartree
kineticenergy: 2044.53786379 hartree
xcener: -151.871563895106 hartree
chargesum: -0.0000000
charge: -0.027254 -0.038256 -0.250479 -0.385797 -0.297447 -0.002740 0.138275 -0.018427 -0.170842 -0.291178 -0.270451 -0.245296 0.393325 0.090041 0.310750 -0.006629 -0.255729 -0.138115 -0.174582 0.216047 -0.094088 -0.198667 0.229147 -0.202061 -0.149100 -0.092806 -0.107097 -0.143916 0.111323 0.107738 0.093129 0.093190 0.101919 0.093833 0.097708 0.089847 0.118820 0.122529 0.135874 0.121637 0.130027 0.129237 0.126590 0.127015 0.126648 0.131040 0.125266
qa: -0.0273 -0.0383 -0.2505 -0.3858 -0.2974 -0.0027 0.1383 -0.0184 -0.1708 -0.2912 -0.2705 -0.2453 0.3933 0.0900 0.3108 -0.0066 -0.2557 -0.1381 -0.1746 0.2160 -0.0941 -0.1987 0.2291 -0.2021 -0.1491 -0.0928 -0.1071 -0.1439 0.1113 0.1077 0.0931 0.0932 0.1019 0.0938 0.0977 0.0898 0.1188 0.1225 0.1359 0.1216 0.1300 0.1292 0.1266 0.1270 0.1266 0.1310 0.1253
va: 1.3058 1.2679 2.1282 2.1113 2.1155 3.1162 3.7099 3.8449 3.9082 3.9072 3.9146 3.9052 4.1505 4.2101 3.8306 3.7152 4.0223 3.8859 4.0443 3.8703 3.9487 4.0439 3.8517 4.0406 3.9556 3.9385 3.9381 3.9875 1.0242 1.0248 0.9967 1.0044 1.0130 1.0013 1.0060 1.0010 1.0168 1.0205 1.0212 1.0171 0.9995 1.0118 1.0129 1.0009 0.9985 0.9953 1.0011
dispcorr: -0.026217854 hartree
energy: -2050.685801267935
dipole: -9.86155 8.14787 -1.71368 -36.23346 35.16443 -1.06903 -4.88035 4.38331 -0.49703
magnitude: 2.08004 au
magnitude: 5.28704 debye
