program: Orca
programVersion: 5.0.2
elementType: Cl Cl O O O N C C C C C C C C C C C C C C C C C C C C C C H H H H H H H H H H H H H H H H H H H
charge: 0
multiplicity: 1
keywords: wb97x-d3
keywords: def2-TZVPP
keywords: def2/J RIJCOSX
keywords: DEFGRID2
keywords: scfconv7
keywords: smallprint printgap noloewdin
keywords: NOSOSCF
formula: C22H19Cl2NO3
InChI: InChI=1/C22H19Cl2NO3/c1-22(2)17(12-19(23)24)20(22)21(26)28-18(13-25)14-7-6-10-16(11-14)27-15-8-4-3-5-9-15/h3-12,17-18,20H,1-2H3
47 atoms
Cl -1.394953 -0.088297 -1.5392
Cl -3.814021 1.000155 -2.69538
O  1.565803 1.613832 0.584917
O  0.316332 0.71643 2.210825
O  0.510291 -3.841026 0.287857
N  4.831268 1.648404 0.046592
C  -0.615204 3.792607 0.3959
C  -0.761364 2.745745 -0.654903
C  -0.673728 2.330997 0.801401
C  0.670893 4.579504 0.473984
C  -1.828485 4.605084 0.784749
C  -2.019835 2.504176 -1.39169
C  0.429148 1.482959 1.294582
C  -2.369523 1.297811 -1.819507
C  2.550173 0.596358 0.761223
C  2.183446 -0.602022 -0.079077
C  3.822076 1.19576 0.355645
C  1.582915 -1.68955 0.53979
C  2.33906 -0.56789 -1.458273
C  1.106558 -2.740967 -0.234516
C  1.882644 -1.633365 -2.216666
C  1.256826 -2.712374 -1.615872
C  -0.052194 -3.800692 1.53597
C  0.304053 -4.79691 2.430914
C  -0.984998 -2.832301 1.884217
C  -0.281546 -4.825661 3.687793
C  -1.551641 -2.865126 3.148322
C  -1.205141 -3.85849 4.053323
H  0.136926 2.542343 -1.230752
H  -1.609178 2.036407 1.262986
H  0.579094 5.489138 -0.121721
H  1.534412 4.033062 0.104365
H  0.878003 4.880594 1.502122
H  -1.955111 5.452452 0.108505
H  -1.714138 5.002666 1.793581
H  -2.749672 4.022383 0.765406
H  -2.678902 3.333956 -1.61663
H  2.631064 0.314738 1.815267
H  1.468075 -1.699807 1.615392
H  2.813858 0.277287 -1.93999
H  2.003557 -1.620034 -3.291318
H  0.88723 -3.539405 -2.207589
H  1.030837 -5.543244 2.138313
H  -1.261869 -2.055794 1.182217
H  -0.005976 -5.605311 4.385529
H  -2.270728 -2.10594 3.424624
H  -1.654539 -3.878469 5.036876
totalener: -2050.65625435 hartree
nucrepener: 2926.61236704 hartree
electener: -4977.26862139 hartree
oneelecener: -8628.64607937 hartree
twoeener: 3651.37745799 hartree
kineticenergy: 2044.54118285 hartree
xcener: -151.873515108249 hartree
chargesum: 0.0000000
charge: -0.039342 -0.039305 -0.266005 -0.354320 -0.292741 -0.001068 0.119908 -0.027208 -0.098308 -0.243848 -0.278446 -0.247641 0.337881 0.102017 0.298790 0.020560 -0.269955 -0.162429 -0.202749 0.262781 -0.078479 -0.223532 0.249203 -0.200036 -0.147503 -0.098660 -0.104943 -0.135930 0.109018 0.097393 0.085530 0.097993 0.094318 0.097020 0.097996 0.084111 0.121181 0.123973 0.133541 0.114971 0.127439 0.127087 0.125101 0.110031 0.125769 0.123521 0.125310
qa: -0.0393 -0.0393 -0.2660 -0.3543 -0.2927 -0.0011 0.1199 -0.0272 -0.0983 -0.2438 -0.2784 -0.2476 0.3379 0.1020 0.2988 0.0206 -0.2700 -0.1624 -0.2027 0.2628 -0.0785 -0.2235 0.2492 -0.2000 -0.1475 -0.0987 -0.1049 -0.1359 0.1090 0.0974 0.0855 0.0980 0.0943 0.0970 0.0980 0.0841 0.1212 0.1240 0.1335 0.1150 0.1274 0.1271 0.1251 0.1100 0.1258 0.1235 0.1253
va: 1.3174 1.2685 2.0951 2.1399 2.1241 3.1121 3.7394 3.8389 3.8346 3.9007 3.9194 3.8935 4.2140 4.1961 3.8625 3.6273 4.0139 3.9109 4.0168 3.8308 3.9347 4.0100 3.7716 4.0425 3.9599 3.9320 3.9658 3.9521 1.0226 1.0229 1.0032 1.0134 1.0021 0.9997 1.0060 1.0016 1.0156 1.0183 1.0193 1.0188 0.9998 1.0144 1.0131 1.0186 0.9992 1.0011 1.0003
dispcorr: -0.028539824 hartree
energy: -2050.684794171296
dipole: 5.64508 -6.86513 -1.22004 11.25788 -10.73519 0.52269 17.10250 -16.98857 0.11393
magnitude: 1.33218 au
magnitude: 3.38612 debye
