program: Orca
programVersion: 5.0.2
elementType: Cl Cl O O O N C C C C C C C C C C C C C C C C C C C C C C H H H H H H H H H H H H H H H H H H H
charge: 0
multiplicity: 1
keywords: wb97x-d3
keywords: def2-TZVPP
keywords: def2/J RIJCOSX
keywords: DEFGRID2
keywords: scfconv7
keywords: smallprint printgap noloewdin
keywords: NOSOSCF
formula: C22H19Cl2NO3
InChI: InChI=1/C22H19Cl2NO3/c1-22(2)17(12-19(23)24)20(22)21(26)28-18(13-25)14-7-6-10-16(11-14)27-15-8-4-3-5-9-15/h3-12,17-18,20H,1-2H3
47 atoms
Cl -1.137267 6.267277 0.521401
Cl -2.936897 6.415255 -1.727921
O  1.038495 0.478453 -1.411455
O  1.49881 1.776139 0.352873
O  0.644774 -4.514246 -0.033356
N  2.98564 -0.978733 -3.658203
C  -1.641775 1.911718 0.489391
C  -1.08611 3.187577 -0.072492
C  -0.664662 1.862925 -0.669904
C  -1.209111 1.506291 1.87698
C  -3.064087 1.513603 0.175712
C  -1.896312 4.103834 -0.885993
C  0.727172 1.404521 -0.487813
C  -1.973503 5.417538 -0.714249
C  2.30989 -0.148985 -1.275434
C  2.243954 -1.286812 -0.28661
C  2.672971 -0.61224 -2.61569
C  1.475023 -2.404405 -0.57888
C  2.904282 -1.187573 0.92955
C  1.378687 -3.435782 0.343658
C  2.804256 -2.226031 1.842077
C  2.048312 -3.352267 1.560528
C  0.119524 -5.3489 0.915025
C  -0.774409 -4.878224 1.86798
C  0.459069 -6.691041 0.864357
C  -1.3262 -5.766974 2.776787
C  -0.106828 -7.572273 1.774192
C  -0.996509 -7.114567 2.733928
H  -0.331768 3.65891 0.547321
H  -1.100597 1.595598 -1.626118
H  -0.215818 1.86341 2.13527
H  -1.214219 0.419887 1.982449
H  -1.909311 1.91332 2.608065
H  -3.760116 2.04078 0.83002
H  -3.200367 0.443389 0.33669
H  -3.354229 1.725749 -0.852613
H  -2.476087 3.689906 -1.701789
H  3.064994 0.57591 -0.95642
H  0.955965 -2.493938 -1.525788
H  3.483605 -0.305406 1.166006
H  3.323386 -2.161123 2.788762
H  1.989357 -4.157623 2.280578
H  -1.039682 -3.828939 1.894924
H  1.154209 -7.038144 0.111363
H  -2.024663 -5.403552 3.518876
H  0.15467 -8.621175 1.732024
H  -1.434433 -7.803823 3.443079
totalener: -2050.66156967 hartree
nucrepener: 2673.27960570 hartree
electener: -4723.94117537 hartree
oneelecener: -8121.68422460 hartree
twoeener: 3397.74304924 hartree
kineticenergy: 2044.54212262 hartree
xcener: -151.871726078324 hartree
chargesum: 0.0000000
charge: -0.038854 -0.042789 -0.261505 -0.376895 -0.291568 -0.000343 0.067627 0.043167 -0.096118 -0.247590 -0.239087 -0.202548 0.349841 0.047934 0.331100 0.002524 -0.266608 -0.198953 -0.124678 0.204778 -0.119481 -0.149678 0.206829 -0.150672 -0.178250 -0.120323 -0.106422 -0.127942 0.089070 0.082999 0.101898 0.087075 0.090997 0.099685 0.093376 0.073358 0.099599 0.119926 0.121377 0.116927 0.130077 0.134207 0.132140 0.128956 0.127821 0.128502 0.128513
qa: -0.0389 -0.0428 -0.2615 -0.3769 -0.2916 -0.0003 0.0676 0.0432 -0.0961 -0.2476 -0.2391 -0.2025 0.3498 0.0479 0.3311 0.0025 -0.2666 -0.1990 -0.1247 0.2048 -0.1195 -0.1497 0.2068 -0.1507 -0.1783 -0.1203 -0.1064 -0.1279 0.0891 0.0830 0.1019 0.0871 0.0910 0.0997 0.0934 0.0734 0.0996 0.1199 0.1214 0.1169 0.1301 0.1342 0.1321 0.1290 0.1278 0.1285 0.1285
va: 1.2883 1.2628 2.1366 2.1269 2.1108 3.1187 3.7605 3.8254 3.8817 3.9150 3.9067 3.9135 4.2416 4.2504 3.8236 3.6860 4.0318 4.0876 3.9815 3.8978 3.9774 3.9257 3.8335 3.9655 4.0285 3.9475 3.9376 3.9484 1.0482 1.0361 1.0210 1.0019 1.0018 1.0029 1.0045 1.0100 1.0284 1.0184 1.0296 1.0192 1.0011 1.0053 1.0029 1.0115 0.9999 0.9989 0.9996
dispcorr: -0.023137137 hartree
energy: -2050.684706805112
dipole: -1.66387 0.70841 -0.95546 -39.54211 38.63919 -0.90293 17.88912 -16.15413 1.73499
magnitude: 2.17678 au
magnitude: 5.53294 debye
