program: Orca
programVersion: 5.0.2
elementType: Cl Cl O O O N C C C C C C C C C C C C C C C C C C C C C C H H H H H H H H H H H H H H H H H H H
charge: 0
multiplicity: 1
keywords: wb97x-d3
keywords: def2-TZVPP
keywords: def2/J RIJCOSX
keywords: DEFGRID2
keywords: scfconv7
keywords: smallprint printgap noloewdin
keywords: NOSOSCF
formula: C22H19Cl2NO3
InChI: InChI=1/C22H19Cl2NO3/c1-22(2)17(12-19(23)24)20(22)21(26)28-18(13-25)14-7-6-10-16(11-14)27-15-8-4-3-5-9-15/h3-12,17-18,20H,1-2H3
47 atoms
Cl -1.92877 0.284644 -2.484828
Cl -4.533959 0.556013 -1.274212
O  1.710867 1.51338 0.439125
O  1.218024 1.380367 2.622412
O  0.817416 -3.603799 0.253584
N  4.848785 2.297346 -0.28114
C  -0.557602 3.586362 0.300604
C  -0.980364 2.242164 -0.215463
C  -0.363807 2.362225 1.168893
C  0.608802 4.270191 -0.371829
C  -1.600168 4.567825 0.784828
C  -2.384151 1.831436 -0.325971
C  0.922183 1.717814 1.510717
C  -2.874147 1.007699 -1.244322
C  2.921318 0.783452 0.62097
C  2.80056 -0.54384 -0.089361
C  4.002546 1.626339 0.109374
C  1.88813 -1.45503 0.433825
C  3.521681 -0.85105 -1.231535
C  1.681001 -2.665194 -0.209594
C  3.326561 -2.079804 -1.848988
C  2.406347 -2.983556 -1.353477
C  -0.313273 -3.221097 0.925583
C  -1.192741 -2.285707 0.39435
C  -0.586934 -3.845788 2.131531
C  -2.354491 -1.980406 1.085923
C  -1.75672 -3.536245 2.809658
C  -2.641104 -2.601857 2.293472
H  -0.323617 1.823192 -0.967868
H  -1.050875 2.29255 2.004625
H  1.153162 4.89442 0.338537
H  0.238418 4.921334 -1.164949
H  1.316378 3.579504 -0.821496
H  -1.139949 5.313508 1.434046
H  -2.403163 4.101096 1.35429
H  -2.051285 5.093139 -0.058248
H  -3.088752 2.208642 0.40477
H  3.10122 0.621271 1.688287
H  1.344753 -1.224353 1.342702
H  4.233803 -0.148963 -1.644244
H  3.890569 -2.32712 -2.738167
H  2.242608 -3.935671 -1.840524
H  -0.982755 -1.808351 -0.554458
H  0.109063 -4.573778 2.526855
H  -3.046815 -1.26238 0.666832
H  -1.972392 -4.027326 3.749274
H  -3.552354 -2.363463 2.824973
totalener: -2050.65903913 hartree
nucrepener: 2916.24593447 hartree
electener: -4966.90497360 hartree
oneelecener: -8607.35558337 hartree
twoeener: 3640.45060977 hartree
kineticenergy: 2044.52705865 hartree
xcener: -151.872134748008 hartree
chargesum: 0.0000000
charge: -0.046221 -0.049514 -0.265500 -0.345320 -0.296976 0.001227 0.060847 0.086412 -0.088429 -0.238919 -0.255470 -0.226757 0.347519 0.052777 0.325983 -0.021137 -0.290240 -0.148366 -0.169416 0.194575 -0.081089 -0.200308 0.235099 -0.176092 -0.207450 -0.087537 -0.082834 -0.156574 0.083920 0.084741 0.096200 0.089105 0.093721 0.098024 0.074778 0.100326 0.099459 0.138052 0.146758 0.127031 0.129999 0.128766 0.130295 0.125798 0.131792 0.126230 0.124719
qa: -0.0462 -0.0495 -0.2655 -0.3453 -0.2970 0.0012 0.0608 0.0864 -0.0884 -0.2389 -0.2555 -0.2268 0.3475 0.0528 0.3260 -0.0211 -0.2902 -0.1484 -0.1694 0.1946 -0.0811 -0.2003 0.2351 -0.1761 -0.2075 -0.0875 -0.0828 -0.1566 0.0839 0.0847 0.0962 0.0891 0.0937 0.0980 0.0748 0.1003 0.0995 0.1381 0.1468 0.1270 0.1300 0.1288 0.1303 0.1258 0.1318 0.1262 0.1247
va: 1.2766 1.2495 2.0865 2.1604 2.1169 3.1164 3.7872 3.7290 3.8399 3.9155 3.9179 3.9256 4.2684 4.2078 3.7998 3.8274 4.0412 3.8713 3.9886 3.8801 3.9638 4.0425 3.8649 3.9556 4.0485 3.8900 3.9256 4.0069 1.0486 1.0311 1.0027 1.0021 1.0160 1.0034 1.0101 1.0015 1.0318 1.0257 1.0163 1.0220 0.9996 1.0117 1.0183 1.0132 1.0079 0.9984 1.0014
dispcorr: -0.027873720 hartree
energy: -2050.686912846743
dipole: 7.82791 -8.99292 -1.16501 10.68133 -10.59567 0.08565 12.50119 -12.43925 0.06194
magnitude: 1.16980 au
magnitude: 2.97339 debye
