program: Orca
programVersion: 5.0.2
elementType: Cl Cl O O O N C C C C C C C C C C C C C C C C C C C C C C H H H H H H H H H H H H H H H H H H H
charge: 0
multiplicity: 1
keywords: wb97x-d3
keywords: def2-TZVPP
keywords: def2/J RIJCOSX
keywords: DEFGRID2
keywords: scfconv7
keywords: smallprint printgap noloewdin
keywords: NOSOSCF
formula: C22H19Cl2NO3
InChI: InChI=1/C22H19Cl2NO3/c1-22(2)17(12-19(23)24)20(22)21(26)28-18(13-25)14-7-6-10-16(11-14)27-15-8-4-3-5-9-15/h3-12,17-18,20H,1-2H3
47 atoms
Cl -2.26073 5.375612 1.294328
Cl -2.283602 6.796581 -1.214528
O  1.678352 1.005159 -0.720997
O  0.311483 1.034626 1.053159
O  1.080445 -3.892657 1.846156
N  4.98014 1.0987 -0.857248
C  -1.868187 1.592433 -1.12603
C  -1.48066 2.875041 -0.452462
C  -0.403586 1.973474 -1.029002
C  -2.437698 0.489692 -0.266331
C  -2.46459 1.620606 -2.513836
C  -1.711597 4.190731 -1.062053
C  0.523216 1.297827 -0.099074
C  -2.041901 5.297832 -0.407346
C  2.659161 0.300216 0.03743
C  2.477362 -1.190774 -0.105289
C  3.955301 0.750037 -0.473985
C  1.861726 -1.895031 0.918168
C  2.864315 -1.842037 -1.270928
C  1.645968 -3.261123 0.784352
C  2.644961 -3.203118 -1.391973
C  2.040352 -3.922339 -0.372104
C  0.347754 -5.030911 1.651707
C  -0.713345 -5.063866 0.755579
C  0.659999 -6.142363 2.41816
C  -1.456797 -6.226044 0.627207
C  -0.098632 -7.296391 2.287205
C  -1.153378 -7.34592 1.388968
H  -1.542996 2.8489 0.629329
H  0.05166 2.292141 -1.959749
H  -3.523886 0.585243 -0.227002
H  -2.065686 0.508202 0.75421
H  -2.207178 -0.489096 -0.690941
H  -3.529754 1.852465 -2.468089
H  -2.356539 0.64439 -2.988527
H  -1.994647 2.350615 -3.171775
H  -1.598995 4.285107 -2.134922
H  2.600904 0.583386 1.092474
H  1.539536 -1.392159 1.820978
H  3.34753 -1.297683 -2.072129
H  2.957293 -3.719954 -2.289422
H  1.888249 -4.988271 -0.478514
H  -0.959792 -4.188281 0.168319
H  1.486711 -6.096197 3.114739
H  -2.284323 -6.252077 -0.069342
H  0.143724 -8.162415 2.888626
H  -1.739787 -8.248732 1.286327
totalener: -2050.66186851 hartree
nucrepener: 2671.60044425 hartree
electener: -4722.26231276 hartree
oneelecener: -8118.34017724 hartree
twoeener: 3396.07786448 hartree
kineticenergy: 2044.52254717 hartree
xcener: -151.868784620774 hartree
chargesum: -0.0000000
charge: -0.037883 -0.043702 -0.257538 -0.385854 -0.293889 -0.002756 0.067110 0.039689 -0.094736 -0.250493 -0.249031 -0.202074 0.369677 0.052795 0.312962 -0.001970 -0.256092 -0.157691 -0.164435 0.201017 -0.122279 -0.143490 0.218451 -0.153432 -0.189022 -0.118941 -0.100986 -0.132480 0.087827 0.082997 0.090778 0.104906 0.085854 0.100708 0.093533 0.075496 0.096696 0.122541 0.123483 0.121701 0.131696 0.134277 0.133499 0.127500 0.127630 0.128118 0.127833
qa: -0.0379 -0.0437 -0.2575 -0.3859 -0.2939 -0.0028 0.0671 0.0397 -0.0947 -0.2505 -0.2490 -0.2021 0.3697 0.0528 0.3130 -0.0020 -0.2561 -0.1577 -0.1644 0.2010 -0.1223 -0.1435 0.2185 -0.1534 -0.1890 -0.1189 -0.1010 -0.1325 0.0878 0.0830 0.0908 0.1049 0.0859 0.1007 0.0935 0.0755 0.0967 0.1225 0.1235 0.1217 0.1317 0.1343 0.1335 0.1275 0.1276 0.1281 0.1278
va: 1.2895 1.2611 2.1338 2.1146 2.1088 3.1158 3.7563 3.8318 3.8722 3.9161 3.9111 3.9249 4.2248 4.2546 3.8249 3.7004 4.0245 4.0205 4.0384 3.9052 3.9709 3.9329 3.8245 3.9553 4.0323 3.9444 3.9378 3.9538 1.0497 1.0348 1.0017 1.0207 1.0020 1.0019 1.0040 1.0103 1.0317 1.0204 1.0326 1.0163 1.0010 1.0044 1.0019 1.0125 0.9999 0.9988 0.9998
dispcorr: -0.022852337 hartree
energy: -2050.684720845782
dipole: -3.67334 2.23330 -1.44004 -43.58295 41.92091 -1.66203 -7.27251 6.59262 -0.67989
magnitude: 2.30181 au
magnitude: 5.85074 debye
