program: Orca
programVersion: 5.0.2
elementType: Cl Cl O O O N C C C C C C C C C C C C C C C C C C C C C C H H H H H H H H H H H H H H H H H H H
charge: 0
multiplicity: 1
keywords: wb97x-d3
keywords: def2-TZVPP
keywords: def2/J RIJCOSX
keywords: DEFGRID2
keywords: scfconv7
keywords: smallprint printgap noloewdin
keywords: NOSOSCF
formula: C22H19Cl2NO3
InChI: InChI=1/C22H19Cl2NO3/c1-22(2)17(12-19(23)24)20(22)21(26)28-18(13-25)14-7-6-10-16(11-14)27-15-8-4-3-5-9-15/h3-12,17-18,20H,1-2H3
47 atoms
Cl -0.34738 6.254186 1.502102
Cl -1.05405 7.571037 -0.965903
O  0.430095 0.597913 -1.494451
O  0.494059 1.182315 0.66545
O  1.004649 -4.17153 1.884148
N  2.56378 -1.001382 -3.461072
C  -2.210336 2.601226 -0.093163
C  -1.102104 3.609822 -0.013241
C  -0.923293 2.368005 -0.861272
C  -2.52554 1.798767 1.145729
C  -3.432966 2.902503 -0.927689
C  -1.193475 4.918722 -0.674496
C  0.059838 1.350215 -0.439143
C  -0.899469 6.085765 -0.115043
C  1.322109 -0.471802 -1.2238
C  0.598027 -1.700363 -0.724716
C  2.005638 -0.754493 -2.488327
C  1.109995 -2.399514 0.355484
C  -0.549391 -2.145781 -1.369392
C  0.475936 -3.553646 0.795168
C  -1.181461 -3.290381 -0.913105
C  -0.679058 -4.000565 0.166461
C  1.029151 -5.536525 1.952672
C  1.365985 -6.3250 0.859308
C  0.760967 -6.115083 3.184244
C  1.424984 -7.701688 1.009396
C  0.834138 -7.492652 3.321617
C  1.160237 -8.292212 2.236473
H  -0.549201 3.596512 0.919253
H  -0.999456 2.493912 -1.935592
H  -2.929558 0.819919 0.8817
H  -3.282567 2.321536 1.732112
H  -1.660346 1.642968 1.784332
H  -3.956054 1.978393 -1.176816
H  -3.202458 3.406119 -1.865666
H  -4.124826 3.538254 -0.373348
H  -1.530779 4.950403 -1.703061
H  2.079049 -0.16802 -0.493397
H  1.999587 -2.056253 0.868773
H  -0.946497 -1.609078 -2.220858
H  -2.079879 -3.639622 -1.403982
H  -1.183689 -4.892294 0.514663
H  1.587981 -5.872711 -0.09879
H  0.504752 -5.484953 4.025666
H  1.689756 -8.314957 0.158305
H  0.627746 -7.941805 4.284015
H  1.212415 -9.366696 2.34677
totalener: -2050.66090748 hartree
nucrepener: 2635.99293481 hartree
electener: -4686.65384229 hartree
oneelecener: -8047.14455024 hartree
twoeener: 3360.49070795 hartree
kineticenergy: 2044.53194000 hartree
xcener: -151.869939793007 hartree
chargesum: 0.0000000
charge: -0.038355 -0.042907 -0.270916 -0.365753 -0.296996 0.000503 0.066665 0.043543 -0.096762 -0.243591 -0.240212 -0.201551 0.333401 0.048611 0.309590 0.059420 -0.252253 -0.170491 -0.190533 0.187837 -0.108061 -0.140996 0.233412 -0.155533 -0.207461 -0.119592 -0.092624 -0.141921 0.089252 0.082494 0.087433 0.090848 0.103107 0.093880 0.073443 0.100179 0.098446 0.121960 0.111992 0.126194 0.130662 0.137477 0.136140 0.126981 0.129254 0.126830 0.126954
qa: -0.0384 -0.0429 -0.2709 -0.3658 -0.2970 0.0005 0.0667 0.0435 -0.0968 -0.2436 -0.2402 -0.2016 0.3334 0.0486 0.3096 0.0594 -0.2523 -0.1705 -0.1905 0.1878 -0.1081 -0.1410 0.2334 -0.1555 -0.2075 -0.1196 -0.0926 -0.1419 0.0893 0.0825 0.0874 0.0908 0.1031 0.0939 0.0734 0.1002 0.0984 0.1220 0.1120 0.1262 0.1307 0.1375 0.1361 0.1270 0.1293 0.1268 0.1270
va: 1.2890 1.2624 2.1205 2.1396 2.1077 3.1208 3.7611 3.8318 3.8734 3.9128 3.9077 3.9138 4.2578 4.2497 3.8303 3.6604 4.0207 4.0854 4.0198 3.9232 3.9487 3.9470 3.8076 3.9351 4.0345 3.9525 3.9367 3.9594 1.0487 1.0359 1.0028 1.0015 1.0206 1.0045 1.0098 1.0032 1.0290 1.0233 1.0250 1.0193 1.0006 1.0016 1.0030 1.0134 0.9997 0.9986 1.0001
dispcorr: -0.022779423 hartree
energy: -2050.683686901541
dipole: -12.67510 11.12385 -1.55124 -41.78260 40.92030 -0.86230 3.09290 -2.59999 0.49292
magnitude: 1.84198 au
magnitude: 4.68193 debye
