program: Orca
programVersion: 5.0.2
elementType: Cl Cl O O O N C C C C C C C C C C C C C C C C C C C C C C H H H H H H H H H H H H H H H H H H H
charge: 0
multiplicity: 1
keywords: wb97x-d3
keywords: def2-TZVPP
keywords: def2/J RIJCOSX
keywords: DEFGRID2
keywords: scfconv7
keywords: smallprint printgap noloewdin
keywords: NOSOSCF
formula: C22H19Cl2NO3
InChI: InChI=1/C22H19Cl2NO3/c1-22(2)17(12-19(23)24)20(22)21(26)28-18(13-25)14-7-6-10-16(11-14)27-15-8-4-3-5-9-15/h3-12,17-18,20H,1-2H3
47 atoms
Cl -1.666668 3.636348 1.946414
Cl -3.146652 5.827964 0.783173
O  1.482123 1.148916 0.1645
O  -0.419033 -0.02101 0.326377
O  1.530457 -4.59664 -0.547405
N  4.436191 1.084893 1.650094
C  -1.199187 1.907079 -2.056612
C  -1.90366 2.284169 -0.797001
C  -0.405867 2.10603 -0.773998
C  -1.406225 0.522708 -2.620746
C  -0.980119 2.960793 -3.1158
C  -2.486626 3.629525 -0.597129
C  0.167278 0.959638 -0.042968
C  -2.439317 4.280512 0.557505
C  2.179182 0.082416 0.797569
C  2.422468 -1.067756 -0.149749
C  3.440393 0.660345 1.267273
C  1.85161 -2.299843 0.125054
C  3.183441 -0.878746 -1.296082
C  2.036658 -3.354923 -0.760225
C  3.371013 -1.941275 -2.164669
C  2.797512 -3.175845 -1.907671
C  0.392955 -4.763099 0.194396
C  -0.751931 -4.011776 -0.040033
C  0.402091 -5.755142 1.162501
C  -1.889469 -4.260564 0.71111
C  -0.74723 -6.001428 1.898288
C  -1.894291 -5.25387 1.680001
H  -2.449122 1.477773 -0.3128
H  0.195645 3.007252 -0.741411
H  -2.235676 0.536224 -3.329707
H  -1.636879 -0.215897 -1.856836
H  -0.518125 0.185063 -3.157789
H  -1.850682 3.036496 -3.770343
H  -0.122372 2.702746 -3.738214
H  -0.793945 3.948473 -2.693401
H  -3.006691 4.103652 -1.421071
H  1.625757 -0.270254 1.674019
H  1.252489 -2.428105 1.01717
H  3.633929 0.082878 -1.506124
H  3.967176 -1.808283 -3.057379
H  2.937991 -4.005722 -2.587545
H  -0.756294 -3.234251 -0.793208
H  1.303673 -6.32957 1.329784
H  -2.779085 -3.67137 0.533394
H  -0.739647 -6.777304 2.652276
H  -2.78684 -5.443482 2.26042
totalener: -2050.65956208 hartree
nucrepener: 2782.02303081 hartree
electener: -4832.68259290 hartree
oneelecener: -8339.40096090 hartree
twoeener: 3506.71836801 hartree
kineticenergy: 2044.54293421 hartree
xcener: -151.872134455868 hartree
chargesum: -0.0000000
charge: -0.030604 -0.038119 -0.252739 -0.379022 -0.296264 -0.000399 0.116190 -0.027664 -0.144577 -0.244923 -0.274420 -0.235877 0.368753 0.084305 0.314200 0.013122 -0.256416 -0.133333 -0.202282 0.235128 -0.087567 -0.199811 0.244171 -0.163356 -0.205389 -0.106945 -0.093433 -0.141091 0.111629 0.103452 0.089454 0.089516 0.093711 0.095140 0.096550 0.088555 0.118946 0.116828 0.118727 0.123454 0.128450 0.128971 0.129425 0.126382 0.126162 0.126485 0.126524
qa: -0.0306 -0.0381 -0.2527 -0.3790 -0.2963 -0.0004 0.1162 -0.0277 -0.1446 -0.2449 -0.2744 -0.2359 0.3688 0.0843 0.3142 0.0131 -0.2564 -0.1333 -0.2023 0.2351 -0.0876 -0.1998 0.2442 -0.1634 -0.2054 -0.1069 -0.0934 -0.1411 0.1116 0.1035 0.0895 0.0895 0.0937 0.0951 0.0966 0.0886 0.1189 0.1168 0.1187 0.1235 0.1285 0.1290 0.1294 0.1264 0.1262 0.1265 0.1265
va: 1.3024 1.2684 2.1381 2.1239 2.1199 3.1200 3.7403 3.8514 3.8679 3.9018 3.9141 3.9034 4.1824 4.2114 3.8475 3.6378 4.0177 3.9140 4.0357 3.8736 3.9371 4.0345 3.8049 3.9623 4.0407 3.9515 3.9308 3.9608 1.0246 1.0259 1.0041 1.0196 1.0018 1.0005 1.0062 1.0011 1.0157 1.0191 1.0188 1.0168 0.9993 1.0120 1.0012 1.0134 1.0002 0.9990 1.0002
dispcorr: -0.025163785 hartree
energy: -2050.684725869722
dipole: 1.98782 -3.26711 -1.27929 -26.89291 26.47426 -0.41865 -22.09797 20.75027 -1.34770
magnitude: 1.90477 au
magnitude: 4.84154 debye
