program: Orca
programVersion: 5.0.2
elementType: Cl Cl O O O N C C C C C C C C C C C C C C C C C C C C C C H H H H H H H H H H H H H H H H H H H
charge: 0
multiplicity: 1
keywords: wb97x-d3
keywords: def2-TZVPP
keywords: def2/J RIJCOSX
keywords: DEFGRID2
keywords: scfconv7
keywords: smallprint printgap noloewdin
keywords: NOSOSCF
formula: C22H19Cl2NO3
InChI: InChI=1/C22H19Cl2NO3/c1-22(2)17(12-19(23)24)20(22)21(26)28-18(13-25)14-7-6-10-16(11-14)27-15-8-4-3-5-9-15/h3-12,17-18,20H,1-2H3
47 atoms
Cl -2.049559 -0.291513 0.51437
Cl -4.363466 1.005072 1.660209
O  2.122541 1.761986 0.658414
O  1.383766 1.418713 -1.424393
O  0.766686 -3.034696 1.294569
N  4.753786 2.176535 -1.463784
C  -0.568986 3.773265 -0.701022
C  -1.283433 2.474149 -0.559034
C  0.052487 2.663871 0.134229
C  0.007148 4.139201 -2.04732
C  -1.053067 4.970828 0.082291
C  -2.50808 2.328962 0.255655
C  1.213257 1.888223 -0.336323
C  -2.916747 1.166729 0.749289
C  3.28999 1.020339 0.370058
C  3.031789 -0.4499 0.107255
C  4.078723 1.664728 -0.688419
C  1.99963 -1.080762 0.791572
C  3.844261 -1.184869 -0.742742
C  1.785795 -2.435751 0.610417
C  3.630714 -2.546837 -0.899078
C  2.600817 -3.182214 -0.228229
C  -0.390003 -3.319758 0.630778
C  -1.353575 -4.013718 1.354913
C  -0.637536 -2.941161 -0.682886
C  -2.561874 -4.328504 0.759931
C  -1.855384 -3.270479 -1.264612
C  -2.820805 -3.962862 -0.554756
H  -1.230708 1.819743 -1.425115
H  0.019913 2.822317 1.205767
H  0.310367 3.274247 -2.631022
H  0.876459 4.788662 -1.933979
H  -0.740557 4.685716 -2.624568
H  -1.871541 5.467904 -0.442365
H  -0.248091 5.697715 0.197441
H  -1.404263 4.713473 1.081825
H  -3.122167 3.200163 0.447813
H  3.883611 1.106849 1.285503
H  1.345063 -0.536368 1.460609
H  4.640426 -0.704364 -1.295973
H  4.269554 -3.11419 -1.56216
H  2.422347 -4.241981 -0.355225
H  -1.148832 -4.296118 2.37921
H  0.094251 -2.386732 -1.254915
H  -3.308101 -4.865713 1.330226
H  -2.044448 -2.967636 -2.285955
H  -3.766731 -4.211638 -1.015596
totalener: -2050.65623654 hartree
nucrepener: 2926.29775316 hartree
electener: -4976.95398970 hartree
oneelecener: -8628.42289741 hartree
twoeener: 3651.46890771 hartree
kineticenergy: 2044.54607135 hartree
xcener: -151.877321246161 hartree
chargesum: -0.0000000
charge: -0.020754 -0.043370 -0.283695 -0.352268 -0.295558 0.000144 0.104934 -0.054839 -0.082196 -0.242306 -0.277624 -0.211794 0.337645 0.073527 0.426085 -0.027247 -0.281109 -0.206844 -0.137419 0.180455 -0.103619 -0.137530 0.278220 -0.202125 -0.229539 -0.084351 -0.124005 -0.143465 0.114794 0.088750 0.104706 0.092953 0.086413 0.098671 0.096983 0.081326 0.117857 0.122821 0.119600 0.121638 0.131371 0.133287 0.121827 0.133723 0.123181 0.126807 0.123942
qa: -0.0208 -0.0434 -0.2837 -0.3523 -0.2956 0.0001 0.1049 -0.0548 -0.0822 -0.2423 -0.2776 -0.2118 0.3376 0.0735 0.4261 -0.0272 -0.2811 -0.2068 -0.1374 0.1805 -0.1036 -0.1375 0.2782 -0.2021 -0.2295 -0.0844 -0.1240 -0.1435 0.1148 0.0888 0.1047 0.0930 0.0864 0.0987 0.0970 0.0813 0.1179 0.1228 0.1196 0.1216 0.1314 0.1333 0.1218 0.1337 0.1232 0.1268 0.1239
va: 1.3334 1.2647 2.1107 2.1410 2.1008 3.1101 3.7938 3.8817 3.8298 3.8972 3.9111 3.8744 4.1846 4.2237 3.9170 3.7781 4.0536 4.0659 3.9896 3.9016 3.9572 4.0112 3.7188 4.0372 3.8520 3.9542 3.9456 3.9659 1.0248 1.0320 1.0212 1.0027 1.0012 0.9993 1.0067 1.0022 1.0169 0.9848 1.0353 1.0239 1.0006 1.0036 1.0158 1.0164 0.9986 0.9999 1.0001
dispcorr: -0.027685671 hartree
energy: -2050.683922213379
dipole: 7.82211 -8.57804 -0.75592 9.08100 -8.92925 0.15175 -10.74499 11.35499 0.61000
magnitude: 0.98313 au
magnitude: 2.49892 debye
