program: Orca
programVersion: 5.0.2
elementType: Cl Cl O O O N C C C C C C C C C C C C C C C C C C C C C C H H H H H H H H H H H H H H H H H H H
charge: 0
multiplicity: 1
keywords: wb97x-d3
keywords: def2-TZVPP
keywords: def2/J RIJCOSX
keywords: DEFGRID2
keywords: scfconv7
keywords: smallprint printgap noloewdin
keywords: NOSOSCF
formula: C22H19Cl2NO3
InChI: InChI=1/C22H19Cl2NO3/c1-22(2)17(12-19(23)24)20(22)21(26)28-18(13-25)14-7-6-10-16(11-14)27-15-8-4-3-5-9-15/h3-12,17-18,20H,1-2H3
47 atoms
Cl 0.00902 5.124609 -1.408464
Cl -2.57122 6.420387 -1.422566
O  1.125338 0.842334 -1.293665
O  1.350128 1.750271 0.739134
O  -0.401492 -3.479761 0.621443
N  3.110299 -0.737734 -3.423802
C  -1.816051 1.635242 0.438036
C  -1.297003 3.036971 0.464152
C  -0.682917 2.051403 -0.489968
C  -1.547191 0.734309 1.618672
C  -3.134461 1.357836 -0.243256
C  -2.095461 4.169415 -0.054795
C  0.689477 1.570519 -0.244585
C  -1.61503 5.110372 -0.856673
C  2.331486 0.129687 -1.08546
C  2.142696 -1.032424 -0.134925
C  2.749241 -0.346823 -2.40608
C  0.978534 -1.783817 -0.195331
C  3.133418 -1.346712 0.781983
C  0.795622 -2.839072 0.686288
C  2.949403 -2.417767 1.642111
C  1.783558 -3.165291 1.609237
C  -0.494403 -4.788218 1.011175
C  -1.461534 -5.121637 1.946228
C  0.317453 -5.765521 0.449856
C  -1.620221 -6.448547 2.318982
C  0.155836 -7.085555 0.838721
C  -0.810513 -7.432834 1.773173
H  -0.669134 3.281445 1.317799
H  -0.954626 2.131747 -1.53638
H  -0.6157 0.966818 2.129846
H  -1.506244 -0.312052 1.309831
H  -2.355716 0.831866 2.345389
H  -3.964584 1.503243 0.451041
H  -3.173985 0.324661 -0.591032
H  -3.304581 2.003945 -1.104732
H  -3.129426 4.25879 0.257524
H  3.115964 0.79111 -0.701881
H  0.200268 -1.557016 -0.913414
H  4.036948 -0.75338 0.83737
H  3.714927 -2.664197 2.365614
H  1.644227 -3.983912 2.302683
H  -2.086675 -4.346318 2.3695
H  1.064143 -5.498155 -0.287471
H  -2.37807 -6.7100 3.045796
H  0.786403 -7.848319 0.401212
H  -0.93399 -8.465463 2.069644
totalener: -2050.65835610 hartree
nucrepener: 2749.50434760 hartree
electener: -4800.16270370 hartree
oneelecener: -8274.36181579 hartree
twoeener: 3474.19911209 hartree
kineticenergy: 2044.53635145 hartree
xcener: -151.870623424361 hartree
chargesum: 0.0000000
charge: -0.030112 -0.040454 -0.265994 -0.350886 -0.303379 -0.000321 0.117372 -0.002331 -0.156988 -0.250211 -0.269712 -0.254668 0.325814 0.093395 0.316788 0.093514 -0.255873 -0.278872 -0.151057 0.240992 -0.105856 -0.157850 0.206202 -0.185690 -0.146568 -0.105951 -0.123860 -0.128016 0.108809 0.108485 0.103385 0.085013 0.092132 0.093659 0.097712 0.089212 0.119357 0.125378 0.128349 0.106076 0.128646 0.135900 0.125403 0.137799 0.126844 0.130147 0.128265
qa: -0.0301 -0.0405 -0.2660 -0.3509 -0.3034 -0.0003 0.1174 -0.0023 -0.1570 -0.2502 -0.2697 -0.2547 0.3258 0.0934 0.3168 0.0935 -0.2559 -0.2789 -0.1511 0.2410 -0.1059 -0.1578 0.2062 -0.1857 -0.1466 -0.1060 -0.1239 -0.1280 0.1088 0.1085 0.1034 0.0850 0.0921 0.0937 0.0977 0.0892 0.1194 0.1254 0.1283 0.1061 0.1286 0.1359 0.1254 0.1378 0.1268 0.1301 0.1283
va: 1.3012 1.2653 2.1100 2.1510 2.0791 3.1213 3.7402 3.8363 3.8547 3.8962 3.9088 3.9131 4.2364 4.2066 3.8195 3.6262 4.0226 4.0492 4.0490 3.8085 3.9722 3.9535 3.8410 4.0282 3.9569 3.9440 3.9495 3.9473 1.0264 1.0237 1.0174 1.0058 1.0041 1.0015 1.0069 1.0006 1.0168 1.0168 1.0296 1.0131 1.0010 1.0041 1.0113 1.0024 0.9994 0.9996 0.9996
dispcorr: -0.025394252 hartree
energy: -2050.683750353938
dipole: -6.10892 5.14094 -0.96798 -39.97915 39.10211 -0.87703 19.31446 -17.66696 1.64750
magnitude: 2.10248 au
magnitude: 5.34408 debye
