program: Orca
programVersion: 5.0.2
elementType: Cl Cl O O O N C C C C C C C C C C C C C C C C C C C C C C H H H H H H H H H H H H H H H H H H H
charge: 0
multiplicity: 1
keywords: wb97x-d3
keywords: def2-TZVPP
keywords: def2/J RIJCOSX
keywords: DEFGRID2
keywords: scfconv7
keywords: smallprint printgap noloewdin
keywords: NOSOSCF
formula: C22H19Cl2NO3
InChI: InChI=1/C22H19Cl2NO3/c1-22(2)17(12-19(23)24)20(22)21(26)28-18(13-25)14-7-6-10-16(11-14)27-15-8-4-3-5-9-15/h3-12,17-18,20H,1-2H3
47 atoms
Cl -3.227799 4.290716 1.186869
Cl -3.791457 5.259006 -1.471954
O  1.747532 0.665315 -0.817296
O  0.758415 1.116729 1.147313
O  1.381788 -4.31216 0.097252
N  4.858244 1.716388 -1.32515
C  -1.769172 0.539587 -0.684783
C  -1.678976 1.984114 -0.284966
C  -0.475013 1.304954 -0.895076
C  -1.881634 -0.490814 0.412016
C  -2.516981 0.150777 -1.938031
C  -2.356585 3.048351 -1.036836
C  0.705754 1.044119 -0.048365
C  -3.030979 4.059448 -0.503294
C  2.965615 0.332565 -0.172009
C  3.224877 -1.160907 -0.228965
C  4.019188 1.107121 -0.83195
C  2.15777 -2.032575 -0.046096
C  4.509016 -1.659295 -0.395503
C  2.384047 -3.401858 -0.027254
C  4.719416 -3.030714 -0.380795
C  3.667287 -3.907103 -0.193451
C  0.25492 -4.024707 0.813151
C  -0.961027 -4.407654 0.265591
C  0.308315 -3.435723 2.070677
C  -2.128958 -4.205364 0.98564
C  -0.868071 -3.226972 2.772913
C  -2.089602 -3.610319 2.23755
H  -1.601865 2.148986 0.783538
H  -0.241888 1.536122 -1.92854
H  -1.456946 -1.44711 0.099897
H  -2.933483 -0.667435 0.641145
H  -1.392412 -0.191439 1.335765
H  -2.187313 -0.829896 -2.283721
H  -2.371473 0.848906 -2.761388
H  -3.588248 0.092215 -1.739914
H  -2.307158 3.022707 -2.11833
H  2.929267 0.648959 0.876538
H  1.149598 -1.661376 0.079402
H  5.347305 -0.99248 -0.547159
H  5.719728 -3.418622 -0.517201
H  3.826335 -4.977061 -0.182636
H  -0.983294 -4.871129 -0.712002
H  1.257907 -3.147228 2.502706
H  -3.07527 -4.510405 0.558904
H  -0.824869 -2.768346 3.751768
H  -3.002697 -3.448617 2.793959
totalener: -2050.66071724 hartree
nucrepener: 2790.62036439 hartree
electener: -4841.28108163 hartree
oneelecener: -8356.09098208 hartree
twoeener: 3514.80990046 hartree
kineticenergy: 2044.51764381 hartree
xcener: -151.872928466211 hartree
chargesum: 0.0000000
charge: -0.038777 -0.044015 -0.262938 -0.356924 -0.293792 -0.002655 0.106831 0.041497 -0.080577 -0.262314 -0.248208 -0.205691 0.301294 0.051732 0.347613 -0.030045 -0.252768 -0.144845 -0.182598 0.242588 -0.079010 -0.206442 0.232036 -0.192358 -0.157776 -0.104842 -0.114663 -0.141026 0.086607 0.082731 0.055297 0.099444 0.110593 0.096641 0.075307 0.099795 0.097680 0.130608 0.113289 0.127853 0.130498 0.128945 0.125743 0.133605 0.125745 0.130557 0.127734
qa: -0.0388 -0.0440 -0.2629 -0.3569 -0.2938 -0.0027 0.1068 0.0415 -0.0806 -0.2623 -0.2482 -0.2057 0.3013 0.0517 0.3476 -0.0300 -0.2528 -0.1448 -0.1826 0.2426 -0.0790 -0.2064 0.2320 -0.1924 -0.1578 -0.1048 -0.1147 -0.1410 0.0866 0.0827 0.0553 0.0994 0.1106 0.0966 0.0753 0.0998 0.0977 0.1306 0.1133 0.1279 0.1305 0.1289 0.1257 0.1336 0.1257 0.1306 0.1277
va: 1.2888 1.2611 2.1162 2.1466 2.1225 3.1098 3.7492 3.8437 3.8529 3.9074 3.9084 3.9234 4.2881 4.2505 3.7951 3.8618 4.0246 3.9452 4.0042 3.8350 3.9716 4.0324 3.8072 3.9783 3.9347 3.9019 3.9026 3.9052 1.0518 1.0370 1.0082 1.0050 1.0144 1.0033 1.0106 1.0028 1.0302 1.0236 0.9894 1.0220 0.9997 1.0131 1.0144 1.0027 1.0003 1.0000 1.0009
dispcorr: -0.026582139 hartree
energy: -2050.687299376117
dipole: 4.64801 -5.66644 -1.01843 -35.83732 34.27844 -1.55887 0.92026 -0.80057 0.11969
magnitude: 1.86591 au
magnitude: 4.74276 debye
