program: Orca
programVersion: 5.0.2
elementType: Cl Cl O O O N C C C C C C C C C C C C C C C C C C C C C C H H H H H H H H H H H H H H H H H H H
charge: 0
multiplicity: 1
keywords: wb97x-d3
keywords: def2-TZVPP
keywords: def2/J RIJCOSX
keywords: DEFGRID2
keywords: scfconv7
keywords: smallprint printgap noloewdin
keywords: NOSOSCF
formula: C22H19Cl2NO3
InChI: InChI=1/C22H19Cl2NO3/c1-22(2)17(12-19(23)24)20(22)21(26)28-18(13-25)14-7-6-10-16(11-14)27-15-8-4-3-5-9-15/h3-12,17-18,20H,1-2H3
47 atoms
Cl -1.432415 3.498809 -2.705568
Cl -3.576199 5.331469 -2.09137
O  0.323678 0.365872 -0.690035
O  1.725155 2.054342 -0.254202
O  1.63755 -3.944633 2.217223
N  0.43283 -2.066544 -2.942749
C  -0.635106 3.057258 1.553047
C  -0.621464 3.78746 0.253338
C  -0.602959 2.276255 0.247937
C  0.581407 3.126792 2.443148
C  -1.933169 2.967898 2.320258
C  -1.806326 4.511684 -0.25656
C  0.614709 1.597145 -0.235138
C  -2.217658 4.453499 -1.51636
C  1.416804 -0.398173 -1.188697
C  2.134415 -1.136706 -0.085711
C  0.846402 -1.325961 -2.168391
C  1.511193 -2.211673 0.538272
C  3.396047 -0.722944 0.311432
C  2.17462 -2.892156 1.549008
C  4.042246 -1.401829 1.334909
C  3.443098 -2.485102 1.950112
C  0.660899 -4.707286 1.634883
C  -0.49493 -4.939477 2.362853
C  0.836581 -5.279011 0.38131
C  -1.483533 -5.754321 1.830912
C  -0.164452 -6.080077 -0.144046
C  -1.325914 -6.321712 0.576012
H  0.331571 4.239919 -0.010436
H  -1.529863 1.779304 -0.013444
H  1.506641 3.262142 1.889366
H  0.676773 2.218695 3.040605
H  0.480761 3.966243 3.133373
H  -2.069212 3.851239 2.94746
H  -1.92958 2.09659 2.976313
H  -2.802974 2.886333 1.668058
H  -2.356139 5.153493 0.422151
H  2.124423 0.248715 -1.716166
H  0.522056 -2.523366 0.224774
H  3.866596 0.125626 -0.166081
H  5.027971 -1.087966 1.650706
H  3.948323 -3.025605 2.739666
H  -0.611361 -4.488652 3.33957
H  1.743363 -5.099136 -0.182041
H  -2.384706 -5.938056 2.400703
H  -0.03151 -6.519697 -1.123388
H  -2.102157 -6.949716 0.160529
totalener: -2050.66048494 hartree
nucrepener: 2748.48272373 hartree
electener: -4799.14320867 hartree
oneelecener: -8272.62521262 hartree
twoeener: 3473.48200394 hartree
kineticenergy: 2044.53816123 hartree
xcener: -151.871650470792 hartree
chargesum: -0.0000000
charge: -0.029417 -0.039220 -0.259327 -0.386706 -0.296148 -0.004596 0.115061 -0.021605 -0.158847 -0.249104 -0.269343 -0.246692 0.383856 0.093140 0.331681 -0.001749 -0.264191 -0.187987 -0.133561 0.228527 -0.092005 -0.203296 0.244832 -0.203782 -0.172563 -0.094875 -0.099198 -0.140360 0.110431 0.106515 0.101377 0.091472 0.085962 0.093453 0.096556 0.088591 0.119167 0.121615 0.128746 0.117539 0.126885 0.128187 0.124214 0.133911 0.125550 0.129995 0.127309
qa: -0.0294 -0.0392 -0.2593 -0.3867 -0.2961 -0.0046 0.1151 -0.0216 -0.1588 -0.2491 -0.2693 -0.2467 0.3839 0.0931 0.3317 -0.0017 -0.2642 -0.1880 -0.1336 0.2285 -0.0920 -0.2033 0.2448 -0.2038 -0.1726 -0.0949 -0.0992 -0.1404 0.1104 0.1065 0.1014 0.0915 0.0860 0.0935 0.0966 0.0886 0.1192 0.1216 0.1287 0.1175 0.1269 0.1282 0.1242 0.1339 0.1256 0.1300 0.1273
va: 1.3043 1.2671 2.1332 2.1154 2.1169 3.1178 3.7319 3.8424 3.8889 3.9016 3.9150 3.9083 4.1592 4.2054 3.8279 3.6743 4.0279 3.9763 3.9846 3.8545 3.9565 4.0312 3.7945 4.0456 3.9693 3.9313 3.9458 3.9612 1.0257 1.0249 1.0205 1.0016 1.0026 1.0012 1.0064 1.0010 1.0168 1.0191 1.0168 1.0215 1.0000 1.0122 1.0132 1.0030 0.9991 0.9996 1.0000
dispcorr: -0.024313378 hartree
energy: -2050.684798318360
dipole: 10.31548 -10.28875 0.02672 -17.88259 18.35581 0.47322 28.48269 -26.92104 1.56165
magnitude: 1.63200 au
magnitude: 4.14820 debye
