program: Orca
programVersion: 5.0.2
elementType: Cl Cl O O O N C C C C C C C C C C C C C C C C C C C C C C H H H H H H H H H H H H H H H H H H H
charge: 0
multiplicity: 1
keywords: wb97x-d3
keywords: def2-TZVPP
keywords: def2/J RIJCOSX
keywords: DEFGRID2
keywords: scfconv7
keywords: smallprint printgap noloewdin
keywords: NOSOSCF
formula: C22H19Cl2NO3
InChI: InChI=1/C22H19Cl2NO3/c1-22(2)17(12-19(23)24)20(22)21(26)28-18(13-25)14-7-6-10-16(11-14)27-15-8-4-3-5-9-15/h3-12,17-18,20H,1-2H3
47 atoms
Cl -1.999046 -0.193627 -1.75307
Cl -4.547212 0.269599 -0.485643
O  1.748019 1.626881 -0.22072
O  1.940014 1.511164 2.00383
O  0.887689 -3.347871 -0.262128
N  3.785781 1.566014 -2.814046
C  -0.566617 3.58474 0.444655
C  -1.026036 2.276302 -0.119385
C  -0.100414 2.291551 1.084943
C  0.374486 4.425384 -0.385414
C  -1.508246 4.418831 1.281133
C  -2.405357 1.785507 0.018541
C  1.285481 1.779062 1.037131
C  -2.907446 0.755382 -0.651481
C  3.040097 1.066678 -0.359382
C  3.063078 -0.422375 -0.092514
C  3.442268 1.350902 -1.739414
C  1.937431 -1.191867 -0.337662
C  4.227188 -1.007542 0.384467
C  1.970715 -2.551426 -0.055645
C  4.261796 -2.372712 0.614944
C  3.132221 -3.148523 0.410414
C  -0.337977 -2.980311 0.216274
C  -0.507476 -2.144899 1.314076
C  -1.439186 -3.531016 -0.42466
C  -1.791408 -1.854891 1.751678
C  -2.7133 -3.238696 0.031369
C  -2.898371 -2.397435 1.118648
H  -0.544055 1.995244 -1.048136
H  -0.553915 2.079531 2.04645
H  1.038561 5.010048 0.253542
H  -0.201095 5.127448 -0.990426
H  0.98823 3.841059 -1.066297
H  -2.173116 5.004601 0.64424
H  -0.943202 5.115971 1.901074
H  -2.126576 3.825046 1.953861
H  -3.075756 2.294169 0.699755
H  3.751563 1.563041 0.31007
H  1.029035 -0.745972 -0.72452
H  5.102156 -0.401129 0.581983
H  5.167773 -2.834148 0.983653
H  3.141248 -4.210684 0.615191
H  0.343852 -1.723115 1.83231
H  -1.289387 -4.182238 -1.275735
H  -1.920336 -1.203884 2.606378
H  -3.568543 -3.666872 -0.474171
H  -3.894912 -2.165063 1.466483
totalener: -2050.65650310 hartree
nucrepener: 2981.42962623 hartree
electener: -5032.08612934 hartree
oneelecener: -8738.16072601 hartree
twoeener: 3706.07459668 hartree
kineticenergy: 2044.54372795 hartree
xcener: -151.878159092873 hartree
chargesum: -0.0000000
charge: -0.040894 -0.051184 -0.280092 -0.332061 -0.296528 0.004242 0.085052 0.027678 -0.053832 -0.249729 -0.278518 -0.205945 0.303576 0.069998 0.265622 0.109964 -0.257120 -0.182944 -0.178320 0.225079 -0.084991 -0.196283 0.274938 -0.171748 -0.220083 -0.121834 -0.071956 -0.179216 0.097669 0.087034 0.094524 0.090668 0.097579 0.104497 0.098274 0.073992 0.103495 0.130016 0.110339 0.107157 0.128096 0.129000 0.136421 0.123116 0.123835 0.122249 0.129168
qa: -0.0409 -0.0512 -0.2801 -0.3321 -0.2965 0.0042 0.0851 0.0277 -0.0538 -0.2497 -0.2785 -0.2059 0.3036 0.0700 0.2656 0.1100 -0.2571 -0.1829 -0.1783 0.2251 -0.0850 -0.1963 0.2749 -0.1717 -0.2201 -0.1218 -0.0720 -0.1792 0.0977 0.0870 0.0945 0.0907 0.0976 0.1045 0.0983 0.0740 0.1035 0.1300 0.1103 0.1072 0.1281 0.1290 0.1364 0.1231 0.1238 0.1222 0.1292
va: 1.2943 1.2536 2.0841 2.1706 2.1205 3.1168 3.8163 3.7675 3.8044 3.9101 3.9229 3.9282 4.2615 4.2306 3.8501 3.6098 4.0006 3.9911 4.0503 3.8379 3.9431 4.0514 3.7650 3.8878 4.0053 3.8925 3.9128 3.8951 1.0356 1.0276 1.0012 1.0035 1.0125 0.9998 1.0040 1.0077 1.0315 1.0158 1.0295 1.0122 0.9994 1.0107 1.0076 1.0151 1.0029 1.0009 1.0078
dispcorr: -0.030645985 hartree
energy: -2050.687149089146
dipole: 9.24235 -9.86476 -0.62240 13.76052 -13.19507 0.56546 13.32759 -12.17456 1.15303
magnitude: 1.42709 au
magnitude: 3.62739 debye
