program: Orca
programVersion: 5.0.2
elementType: Cl Cl O O O N C C C C C C C C C C C C C C C C C C C C C C H H H H H H H H H H H H H H H H H H H
charge: 0
multiplicity: 1
keywords: wb97x-d3
keywords: def2-TZVPP
keywords: def2/J RIJCOSX
keywords: DEFGRID2
keywords: scfconv7
keywords: smallprint printgap noloewdin
keywords: NOSOSCF
formula: C22H19Cl2NO3
InChI: InChI=1/C22H19Cl2NO3/c1-22(2)17(12-19(23)24)20(22)21(26)28-18(13-25)14-7-6-10-16(11-14)27-15-8-4-3-5-9-15/h3-12,17-18,20H,1-2H3
47 atoms
Cl -2.627245 5.136374 0.130919
Cl -3.901836 4.726865 -2.423596
O  1.51665 0.348419 -0.838965
O  1.06532 1.634129 0.947749
O  1.50788 -4.453132 0.526301
N  4.382715 1.130619 -2.349052
C  -1.872559 0.752754 0.232377
C  -1.638662 2.169195 -0.202034
C  -0.661978 1.089479 -0.619435
C  -1.716338 0.433874 1.699087
C  -2.938767 -0.080429 -0.439296
C  -2.463268 2.81839 -1.229505
C  0.701524 1.090281 -0.055746
C  -2.928397 4.06049 -1.173394
C  2.862937 0.183097 -0.444293
C  3.17858 -1.273993 -0.162117
C  3.703435 0.710284 -1.523959
C  2.156272 -2.187012 0.042347
C  4.505274 -1.675503 -0.063021
C  2.469354 -3.504871 0.356263
C  4.800938 -2.994416 0.237854
C  3.789535 -3.91556 0.454793
C  0.315217 -4.108332 1.097445
C  0.262428 -3.444135 2.317049
C  -0.849834 -4.491827 0.451633
C  -0.96987 -3.172539 2.88916
C  -2.077353 -4.218187 1.037968
C  -2.14366 -3.556089 2.254423
H  -1.271641 2.823764 0.580186
H  -0.716849 0.752139 -1.648364
H  -1.002783 1.080133 2.203609
H  -1.398453 -0.600913 1.838045
H  -2.67998 0.551695 2.197412
H  -2.73919 -1.141428 -0.280543
H  -2.998635 0.081831 -1.514787
H  -3.919262 0.14252 -0.01586
H  -2.724672 2.247916 -2.112189
H  3.066551 0.776163 0.454513
H  1.120312 -1.892705 -0.054088
H  5.309079 -0.969993 -0.2320
H  5.833222 -3.309232 0.308412
H  4.014057 -4.946888 0.691363
H  1.17541 -3.151876 2.819841
H  -0.788836 -5.010836 -0.495794
H  -1.010827 -2.662646 3.842609
H  -2.985844 -4.526187 0.537444
H  -3.101967 -3.346144 2.709661
totalener: -2050.66040643 hartree
nucrepener: 2775.30881524 hartree
electener: -4825.96922167 hartree
oneelecener: -8325.39765087 hartree
twoeener: 3499.42842920 hartree
kineticenergy: 2044.52093968 hartree
xcener: -151.872032651881 hartree
chargesum: -0.0000000
charge: -0.038087 -0.043276 -0.281092 -0.362731 -0.297117 -0.001775 0.094793 0.036971 -0.106376 -0.227680 -0.246439 -0.203349 0.338416 0.051217 0.335069 0.035945 -0.253463 -0.151407 -0.204285 0.211871 -0.084222 -0.199247 0.208729 -0.129247 -0.183545 -0.133774 -0.115448 -0.145608 0.087775 0.083282 0.106004 0.058706 0.092292 0.090289 0.074381 0.099324 0.097268 0.132814 0.126878 0.121739 0.129594 0.129024 0.134749 0.130360 0.138662 0.130865 0.131153
qa: -0.0381 -0.0433 -0.2811 -0.3627 -0.2971 -0.0018 0.0948 0.0370 -0.1064 -0.2277 -0.2464 -0.2033 0.3384 0.0512 0.3351 0.0359 -0.2535 -0.1514 -0.2043 0.2119 -0.0842 -0.1992 0.2087 -0.1292 -0.1835 -0.1338 -0.1154 -0.1456 0.0878 0.0833 0.1060 0.0587 0.0923 0.0903 0.0744 0.0993 0.0973 0.1328 0.1269 0.1217 0.1296 0.1290 0.1347 0.1304 0.1387 0.1309 0.1312
va: 1.2895 1.2619 2.1052 2.1454 2.1106 3.1113 3.7182 3.8683 3.8681 3.8951 3.9169 3.9260 4.2361 4.2507 3.7692 3.7500 4.0001 3.9212 4.0513 3.8540 3.9582 4.0401 3.8371 3.9146 4.0146 3.8829 3.8936 3.8873 1.0496 1.0368 1.0247 1.0205 1.0034 1.0056 1.0116 1.0023 1.0306 1.0277 1.0178 1.0163 0.9993 1.0119 1.0034 1.0114 0.9975 0.9979 0.9999
dispcorr: -0.025770646 hartree
energy: -2050.686177074489
dipole: 2.80028 -3.88054 -1.08026 -34.89376 33.38842 -1.50534 14.39554 -13.43178 0.96376
magnitude: 2.08851 au
magnitude: 5.30856 debye
