program: Orca
programVersion: 5.0.2
elementType: Cl Cl O O O N C C C C C C C C C C C C C C C C C C C C C C H H H H H H H H H H H H H H H H H H H
charge: 0
multiplicity: 1
keywords: wb97x-d3
keywords: def2-TZVPP
keywords: def2/J RIJCOSX
keywords: DEFGRID2
keywords: scfconv7
keywords: smallprint printgap noloewdin
keywords: NOSOSCF
formula: C22H19Cl2NO3
InChI: InChI=1/C22H19Cl2NO3/c1-22(2)17(12-19(23)24)20(22)21(26)28-18(13-25)14-7-6-10-16(11-14)27-15-8-4-3-5-9-15/h3-12,17-18,20H,1-2H3
47 atoms
Cl -2.858815 4.780487 0.760905
Cl -3.829996 5.049344 -1.942184
O  1.641545 0.543036 -0.886838
O  0.896382 1.358228 1.06916
O  1.279402 -4.318368 0.25329
N  4.687181 1.422641 -1.887351
C  -1.849195 0.540646 -0.267649
C  -1.689434 2.032161 -0.235455
C  -0.580315 1.175763 -0.80827
C  -1.834258 -0.203428 1.044443
C  -2.7563 -0.100251 -1.29084
C  -2.438547 2.916893 -1.136686
C  0.69594 1.065357 -0.075467
C  -2.963934 4.090618 -0.807946
C  2.918673 0.277416 -0.341025
C  3.157624 -1.215443 -0.210161
C  3.901497 0.914984 -1.221315
C  2.079895 -2.072574 -0.04281
C  4.453245 -1.716935 -0.198419
C  2.305662 -3.430672 0.141947
C  4.662731 -3.075094 -0.021678
C  3.595298 -3.93915 0.155251
C  0.182972 -4.008816 1.005818
C  0.289794 -3.413244 2.256978
C  -1.057915 -4.373779 0.502981
C  -0.857089 -3.193792 3.004236
C  -2.195821 -4.154914 1.264969
C  -2.102143 -3.563689 2.51613
H  -1.47362 2.44073 0.745069
H  -0.47833 1.15429 -1.887431
H  -1.233939 0.284158 1.808402
H  -1.456784 -1.219085 0.912879
H  -2.852481 -0.286403 1.427449
H  -2.499826 -1.15378 -1.410528
H  -2.694038 0.361767 -2.275259
H  -3.795844 -0.045979 -0.963844
H  -2.578994 2.600595 -2.16275
H  3.007721 0.74271 0.647513
H  1.062313 -1.706886 -0.070107
H  5.300769 -1.058904 -0.340479
H  5.671691 -3.464466 -0.020252
H  3.752013 -5.000642 0.292235
H  1.257993 -3.132391 2.651222
H  -1.121961 -4.839523 -0.471721
H  -0.772219 -2.733746 3.979724
H  -3.161291 -4.446819 0.873261
H  -2.991686 -3.391898 3.10661
totalener: -2050.66047521 hartree
nucrepener: 2787.86507390 hartree
electener: -4838.52554911 hartree
oneelecener: -8350.52482117 hartree
twoeener: 3511.99927206 hartree
kineticenergy: 2044.52043760 hartree
xcener: -151.872804236650 hartree
chargesum: 0.0000000
charge: -0.038035 -0.044021 -0.269000 -0.357965 -0.296641 -0.002725 0.089665 0.045407 -0.088468 -0.203806 -0.249198 -0.206080 0.311421 0.051822 0.339086 0.005741 -0.248337 -0.128678 -0.190953 0.208510 -0.085418 -0.195880 0.210496 -0.125669 -0.194830 -0.121996 -0.090928 -0.155829 0.087686 0.083300 0.107289 0.018861 0.095917 0.092948 0.076321 0.100827 0.096579 0.129651 0.116061 0.124354 0.130264 0.129569 0.131561 0.128537 0.128961 0.127398 0.126229
qa: -0.0380 -0.0440 -0.2690 -0.3580 -0.2966 -0.0027 0.0897 0.0454 -0.0885 -0.2038 -0.2492 -0.2061 0.3114 0.0518 0.3391 0.0057 -0.2483 -0.1287 -0.1910 0.2085 -0.0854 -0.1959 0.2105 -0.1257 -0.1948 -0.1220 -0.0909 -0.1558 0.0877 0.0833 0.1073 0.0189 0.0959 0.0929 0.0763 0.1008 0.0966 0.1297 0.1161 0.1244 0.1303 0.1296 0.1316 0.1285 0.1290 0.1274 0.1262
va: 1.2896 1.2610 2.1109 2.1471 2.1119 3.1086 3.7473 3.8484 3.8522 3.8995 3.9107 3.9261 4.2722 4.2527 3.7836 3.7863 4.0072 3.9435 4.0327 3.8596 3.9621 4.0359 3.8221 3.9011 3.9855 3.9088 3.8937 3.9155 1.0509 1.0372 1.0215 1.0228 1.0049 1.0051 1.0113 1.0017 1.0315 1.0253 1.0034 1.0190 0.9997 1.0116 1.0048 1.0130 1.0014 0.9987 1.0022
dispcorr: -0.026489411 hartree
energy: -2050.686964625352
dipole: 3.25597 -4.28455 -1.02858 -36.54227 34.98094 -1.56133 7.69303 -7.13193 0.56110
magnitude: 1.95206 au
magnitude: 4.96175 debye
