program: Orca
programVersion: 5.0.2
elementType: Cl Cl O O O N C C C C C C C C C C C C C C C C C C C C C C H H H H H H H H H H H H H H H H H H H
charge: 0
multiplicity: 1
keywords: wb97x-d3
keywords: def2-TZVPP
keywords: def2/J RIJCOSX
keywords: DEFGRID2
keywords: scfconv7
keywords: smallprint printgap noloewdin
keywords: NOSOSCF
formula: C22H19Cl2NO3
InChI: InChI=1/C22H19Cl2NO3/c1-22(2)17(12-19(23)24)20(22)21(26)28-18(13-25)14-7-6-10-16(11-14)27-15-8-4-3-5-9-15/h3-12,17-18,20H,1-2H3
47 atoms
Cl -0.087739 5.112587 -1.694365
Cl -2.652201 6.438968 -1.672613
O  1.001168 0.861475 -1.177721
O  1.332026 1.897591 0.777343
O  -0.366176 -3.608063 0.626262
N  2.945366 -0.738027 -3.331759
C  -1.828355 1.881689 0.655478
C  -1.281945 3.262771 0.490341
C  -0.747705 2.158998 -0.381096
C  -1.502127 1.112448 1.91243
C  -3.193499 1.56586 0.093367
C  -2.098853 4.346026 -0.10042
C  0.625572 1.666158 -0.163407
C  -1.668497 5.184316 -1.033412
C  2.213434 0.151752 -0.986514
C  2.04171 -0.994684 -0.015597
C  2.604103 -0.340491 -2.309692
C  0.93702 -1.825918 -0.13053
C  2.984909 -1.213874 0.975851
C  0.769826 -2.875179 0.762032
C  2.816519 -2.275256 1.851099
C  1.713296 -3.107509 1.757772
C  -0.404472 -4.894378 1.092233
C  0.472481 -5.855589 0.607862
C  -1.376394 -5.225734 2.021964
C  0.370552 -7.158454 1.067866
C  -1.47404 -6.53607 2.467691
C  -0.599572 -7.503814 1.998348
H  -0.59742 3.586483 1.270758
H  -1.081767 2.131366 -1.411947
H  -2.276368 1.289635 2.660683
H  -0.549319 1.398188 2.350704
H  -1.472264 0.039482 1.71547
H  -3.974551 1.825679 0.810723
H  -3.281621 0.499116 -0.116375
H  -3.401537 2.102759 -0.832645
H  -3.107937 4.488033 0.268887
H  3.00464 0.819552 -0.6294
H  0.196424 -1.669133 -0.904973
H  3.83807 -0.555906 1.074584
H  3.544732 -2.450218 2.631212
H  1.58776 -3.920968 2.459855
H  1.221409 -5.588435 -0.126448
H  -2.052755 -4.462764 2.384139
H  1.050687 -7.909924 0.689746
H  -2.235179 -6.797184 3.190486
H  -0.676138 -8.523456 2.350603
totalener: -2050.65908394 hartree
nucrepener: 2734.08806061 hartree
electener: -4784.74714455 hartree
oneelecener: -8243.56497872 hartree
twoeener: 3458.81783417 hartree
kineticenergy: 2044.54419678 hartree
xcener: -151.871644338518 hartree
chargesum: -0.0000000
charge: -0.029751 -0.040387 -0.264930 -0.358510 -0.299184 -0.000459 0.115396 -0.003207 -0.154724 -0.250610 -0.270477 -0.250875 0.333029 0.091613 0.325058 0.070606 -0.258177 -0.254948 -0.142790 0.226154 -0.111724 -0.151696 0.201568 -0.144903 -0.179131 -0.122357 -0.108447 -0.126477 0.108597 0.107819 0.088836 0.103279 0.088823 0.093450 0.097326 0.089612 0.118565 0.123071 0.122124 0.107484 0.128715 0.134295 0.137860 0.124869 0.130063 0.127063 0.128488
qa: -0.0298 -0.0404 -0.2649 -0.3585 -0.2992 -0.0005 0.1154 -0.0032 -0.1547 -0.2506 -0.2705 -0.2509 0.3330 0.0916 0.3251 0.0706 -0.2582 -0.2549 -0.1428 0.2262 -0.1117 -0.1517 0.2016 -0.1449 -0.1791 -0.1224 -0.1084 -0.1265 0.1086 0.1078 0.0888 0.1033 0.0888 0.0934 0.0973 0.0896 0.1186 0.1231 0.1221 0.1075 0.1287 0.1343 0.1379 0.1249 0.1301 0.1271 0.1285
va: 1.3013 1.2652 2.1148 2.1440 2.0907 3.1217 3.7395 3.8374 3.8596 3.9010 3.9109 3.9090 4.2308 4.2100 3.8182 3.6444 4.0278 4.0523 4.0317 3.8370 3.9758 3.9369 3.8435 3.9634 4.0273 3.9452 3.9434 3.9461 1.0263 1.0241 1.0036 1.0184 1.0024 1.0013 1.0064 1.0007 1.0171 1.0187 1.0335 1.0135 1.0013 1.0053 1.0021 1.0118 0.9996 0.9994 0.9996
dispcorr: -0.024848460 hartree
energy: -2050.683932402073
dipole: -5.23961 4.29528 -0.94433 -38.47242 37.65500 -0.81742 22.77403 -20.98048 1.79355
magnitude: 2.18558 au
magnitude: 5.55530 debye
